null
SMILES: Oc1cc(CCC2CCCCC2)n[nH]c1=O
InChI Key: InChIKey=XOTMJYKZULIBIT-UHFFFAOYSA-N
Activity Spreadsheet -- Enzyme Inhibition Constant Data from BindingDB
Found 9 hits for monomerid = 50431075
Trg + Lig
Ki
nM
ΔG°
kcal/mole
IC50
nM
Kd
nM
EC50/IC50
nM
koff
s-1
kon
M-1s-1
pHTemp
°C
D-amino-acid oxidase
(Homo sapiens (Human))
BDBM50431075
(CHEMBL2338789 | US10202399, Example 40 | US1046366...)
Show SMILES Oc1cc(CCC2CCCCC2)n[nH]c1=O
Show InChI InChI=1S/C12H18N2O2/c15-11-8-10(13-14-12(11)16)7-6-9-4-2-1-3-5-9/h8-9H,1-7H2,(H,13,15)(H,14,16)
Reactome pathway
US Patent
n/an/a 31n/an/an/an/a7.425
Takeda Pharmaceutical Company Limited
US Patent
Assay Description
Human DAAO enzyme was supplied by the Takeda Pharmaceutical Company (Osaka) and each batch was tested and used at concentrations giving comparable le...
US Patent US9290456 (2016)
BindingDB Entry DOI: 10.7270/Q2RF5SW0
D-amino-acid oxidase
(Homo sapiens (Human))
BDBM50431075
(CHEMBL2338789 | US10202399, Example 40 | US1046366...)
Show SMILES Oc1cc(CCC2CCCCC2)n[nH]c1=O
Show InChI InChI=1S/C12H18N2O2/c15-11-8-10(13-14-12(11)16)7-6-9-4-2-1-3-5-9/h8-9H,1-7H2,(H,13,15)(H,14,16)
Reactome pathway
n/an/a 10n/an/an/an/an/an/a
Astellas Pharma Inc.
Curated by ChEMBL
Assay Description
Inhibition of human full length DAAO overexpressed in HEK293 cells after 30 mins by plate reader analysis
J Med Chem 56: 3582-92 (2013)
Article DOI: 10.1021/jm400095b
BindingDB Entry DOI: 10.7270/Q2HT2QPZ
D-amino-acid oxidase
(Homo sapiens (Human))
BDBM50431075
(CHEMBL2338789 | US10202399, Example 40 | US1046366...)
Show SMILES Oc1cc(CCC2CCCCC2)n[nH]c1=O
Show InChI InChI=1S/C12H18N2O2/c15-11-8-10(13-14-12(11)16)7-6-9-4-2-1-3-5-9/h8-9H,1-7H2,(H,13,15)(H,14,16)
Reactome pathway
n/an/a 4.70n/an/an/an/an/an/a
Astellas Pharma Inc.
Curated by ChEMBL
Assay Description
Inhibition of human recombinant DAAO after 30 mins by plate reader analysis
J Med Chem 56: 3582-92 (2013)
Article DOI: 10.1021/jm400095b
BindingDB Entry DOI: 10.7270/Q2HT2QPZ
D-amino-acid oxidase
(Rattus norvegicus (rat))
BDBM50431075
(CHEMBL2338789 | US10202399, Example 40 | US1046366...)
Show SMILES Oc1cc(CCC2CCCCC2)n[nH]c1=O
Show InChI InChI=1S/C12H18N2O2/c15-11-8-10(13-14-12(11)16)7-6-9-4-2-1-3-5-9/h8-9H,1-7H2,(H,13,15)(H,14,16)
Reactome pathway
n/an/a 8.20n/an/an/an/an/an/a
Astellas Pharma Inc.
Curated by ChEMBL
Assay Description
Inhibition of rat full length DAAO overexpressed in HEK293 cells after 30 mins by plate reader analysis
J Med Chem 56: 3582-92 (2013)
Article DOI: 10.1021/jm400095b
BindingDB Entry DOI: 10.7270/Q2HT2QPZ
D-amino-acid oxidase
(Homo sapiens (Human))
BDBM50431075
(CHEMBL2338789 | US10202399, Example 40 | US1046366...)
Show SMILES Oc1cc(CCC2CCCCC2)n[nH]c1=O
Show InChI InChI=1S/C12H18N2O2/c15-11-8-10(13-14-12(11)16)7-6-9-4-2-1-3-5-9/h8-9H,1-7H2,(H,13,15)(H,14,16)
Reactome pathway
n/an/a 31n/an/an/an/an/an/a
TBA
Citation and Details
D-amino-acid oxidase
(Homo sapiens (Human))
BDBM50431075
(CHEMBL2338789 | US10202399, Example 40 | US1046366...)
Show SMILES Oc1cc(CCC2CCCCC2)n[nH]c1=O
Show InChI InChI=1S/C12H18N2O2/c15-11-8-10(13-14-12(11)16)7-6-9-4-2-1-3-5-9/h8-9H,1-7H2,(H,13,15)(H,14,16)
Reactome pathway
US Patent
n/an/a 4.70n/an/an/an/an/an/a
Takeda Pharmaceutical Company Limited
US Patent
Assay Description
The DAAO inhibitory activity was measured by assaying the amount of hydrogen peroxide (H2O2) produced by reacting DAAO protein with flavin adenine di...
US Patent US10202399 (2019)
BindingDB Entry DOI: 10.7270/Q2542QQD
D-amino-acid oxidase
(Homo sapiens (Human))
BDBM50431075
(CHEMBL2338789 | US10202399, Example 40 | US1046366...)
Show SMILES Oc1cc(CCC2CCCCC2)n[nH]c1=O
Show InChI InChI=1S/C12H18N2O2/c15-11-8-10(13-14-12(11)16)7-6-9-4-2-1-3-5-9/h8-9H,1-7H2,(H,13,15)(H,14,16)
Reactome pathway
US Patent
n/an/a 31n/an/an/an/an/an/a
Universita degli Studi di Firenze
Assay Description
Human DAAO enzyme was supplied by the Takeda Pharmaceutical Company (Osaka) and each batch was tested and used at concentrations giving comparable le...
Bioorg Med Chem Lett 18: 4282-6 (2008)
BindingDB Entry DOI: 10.7270/Q2F76FWC
D-amino-acid oxidase
(Homo sapiens (Human))
BDBM50431075
(CHEMBL2338789 | US10202399, Example 40 | US1046366...)
Show SMILES Oc1cc(CCC2CCCCC2)n[nH]c1=O
Show InChI InChI=1S/C12H18N2O2/c15-11-8-10(13-14-12(11)16)7-6-9-4-2-1-3-5-9/h8-9H,1-7H2,(H,13,15)(H,14,16)
Reactome pathway
US Patent
n/an/a 31n/an/an/an/an/an/a
Takeda Pharmaceutical Company Limited
US Patent
Assay Description
The functional activity of compounds inhibiting the DAAO enzyme was determined by utilizing the co-product of the catalysis of D-Serine, H2O2 which c...
US Patent US10463663 (2019)
BindingDB Entry DOI: 10.7270/Q20K2BXG
D-amino-acid oxidase
(Mus musculus)
BDBM50431075
(CHEMBL2338789 | US10202399, Example 40 | US1046366...)
Show SMILES Oc1cc(CCC2CCCCC2)n[nH]c1=O
Show InChI InChI=1S/C12H18N2O2/c15-11-8-10(13-14-12(11)16)7-6-9-4-2-1-3-5-9/h8-9H,1-7H2,(H,13,15)(H,14,16)
Reactome pathway
n/an/a 3.20n/an/an/an/an/an/a
Astellas Pharma Inc.
Curated by ChEMBL
Assay Description
Inhibition of mouse full length DAAO overexpressed in HEK293 cells after 30 mins by plate reader analysis
J Med Chem 56: 3582-92 (2013)
Article DOI: 10.1021/jm400095b
BindingDB Entry DOI: 10.7270/Q2HT2QPZ