BDBM50431097 CHEMBL2332039
SMILES: CCNC(=O)c1ccc(s1)C(=O)NCCC1CCN(CC1)c1ncnc2cc(sc12)C(N)=O
InChI Key: InChIKey=IXDTWYVAYLILOL-UHFFFAOYSA-N
Data: 4 IC50
PDB links: 1 PDB ID matches this monomer.
Activity Spreadsheet -- Enzyme Inhibition Constant Data from BindingDB
Found 4 hits for monomerid = 50431097
Trg + Lig
Ki
nM
ΔG°
kcal/mole
IC50
nM
Kd
nM
EC50/IC50
nM
koff
s-1
kon
M-1s-1
pHTemp
°C
Potassium voltage-gated channel subfamily H member 2
(Homo sapiens (Human))
BDBM50431097
(CHEMBL2332039)
Show SMILES CCNC(=O)c1ccc(s1)C(=O)NCCC1CCN(CC1)c1ncnc2cc(sc12)C(N)=O
Show InChI InChI=1S/C22H26N6O3S2/c1-2-24-21(30)15-3-4-16(32-15)22(31)25-8-5-13-6-9-28(10-7-13)20-18-14(26-12-27-20)11-17(33-18)19(23)29/h3-4,11-13H,2,5-10H2,1H3,(H2,23,29)(H,24,30)(H,25,31)
Reactome pathway
n/an/a>5.00E+4n/an/an/an/an/an/a
Sirtris a GSK Company
Curated by ChEMBL
Assay Description
Inhibition of human ERG by dofetilide binding assay
J Med Chem 56: 3666-79 (2013)
Article DOI: 10.1021/jm400204k
BindingDB Entry DOI: 10.7270/Q2D50P9C
NAD-Dependent Deacetylase Sirtuin-1
(Homo sapiens (Human))
BDBM50431097
(CHEMBL2332039)
Show SMILES CCNC(=O)c1ccc(s1)C(=O)NCCC1CCN(CC1)c1ncnc2cc(sc12)C(N)=O
Show InChI InChI=1S/C22H26N6O3S2/c1-2-24-21(30)15-3-4-16(32-15)22(31)25-8-5-13-6-9-28(10-7-13)20-18-14(26-12-27-20)11-17(33-18)19(23)29/h3-4,11-13H,2,5-10H2,1H3,(H2,23,29)(H,24,30)(H,25,31)
NCI pathway
Reactome pathway
n/an/a 3.60n/an/an/an/an/an/a
Sirtris a GSK Company
Curated by ChEMBL
Assay Description
Inhibition of His-tagged SIRT1 (1 to 747) (unknown origin)-mediated deacetylation of Ac-RHKKAcW-NH2 substrate preincubated for 20 mins measured after...
J Med Chem 56: 3666-79 (2013)
Article DOI: 10.1021/jm400204k
BindingDB Entry DOI: 10.7270/Q2D50P9C
NAD-dependent deacetylase sirtuin 2
(Homo sapiens (Human))
BDBM50431097
(CHEMBL2332039)
Show SMILES CCNC(=O)c1ccc(s1)C(=O)NCCC1CCN(CC1)c1ncnc2cc(sc12)C(N)=O
Show InChI InChI=1S/C22H26N6O3S2/c1-2-24-21(30)15-3-4-16(32-15)22(31)25-8-5-13-6-9-28(10-7-13)20-18-14(26-12-27-20)11-17(33-18)19(23)29/h3-4,11-13H,2,5-10H2,1H3,(H2,23,29)(H,24,30)(H,25,31)
NCI pathway
n/an/a 2.70n/an/an/an/an/an/a
Sirtris a GSK Company
Curated by ChEMBL
Assay Description
Inhibition of His-tagged SIRT2 (1 to 389) (unknown origin)-mediated deacetylation of Ac-RHKKAcW-NH2 substrate incubated for 20 mins prior to substrat...
J Med Chem 56: 3666-79 (2013)
Article DOI: 10.1021/jm400204k
BindingDB Entry DOI: 10.7270/Q2D50P9C
NAD-dependent protein deacetylase sirtuin-3 (SIRT3)
(Homo sapiens (Human))
BDBM50431097
(CHEMBL2332039)
Show SMILES CCNC(=O)c1ccc(s1)C(=O)NCCC1CCN(CC1)c1ncnc2cc(sc12)C(N)=O
Show InChI InChI=1S/C22H26N6O3S2/c1-2-24-21(30)15-3-4-16(32-15)22(31)25-8-5-13-6-9-28(10-7-13)20-18-14(26-12-27-20)11-17(33-18)19(23)29/h3-4,11-13H,2,5-10H2,1H3,(H2,23,29)(H,24,30)(H,25,31)
n/an/a 4n/an/an/an/an/an/a
Sirtris a GSK Company
Curated by ChEMBL
Assay Description
Inhibition of human His-tagged SIRT3 (102 to 399) expressed in Escherichia coli BL21(DE3) assessed as inhibition of deacetylation of Ac-RHKKAcW-NH2 s...
J Med Chem 56: 3666-79 (2013)
Article DOI: 10.1021/jm400204k
BindingDB Entry DOI: 10.7270/Q2D50P9C
3D
3D Structure (crystal)