BDBM50431116 CHEMBL2332043
SMILES: NC(=O)c1cc2ncnc(N3CCC(CCNC(=O)c4cccs4)CC3)c2s1
InChI Key: InChIKey=CLHJWTGEHRKCOS-UHFFFAOYSA-N
Data: 3 IC50
Activity Spreadsheet -- Enzyme Inhibition Constant Data from BindingDB
Found 3 hits for monomerid = 50431116
Trg + Lig
Ki
nM
ΔG°
kcal/mole
IC50
nM
Kd
nM
EC50/IC50
nM
koff
s-1
kon
M-1s-1
pHTemp
°C
NAD-dependent protein deacetylase sirtuin-3 (SIRT3)
(Homo sapiens (Human))
BDBM50431116
(CHEMBL2332043)
Show SMILES NC(=O)c1cc2ncnc(N3CCC(CCNC(=O)c4cccs4)CC3)c2s1
Show InChI InChI=1S/C19H21N5O2S2/c20-17(25)15-10-13-16(28-15)18(23-11-22-13)24-7-4-12(5-8-24)3-6-21-19(26)14-2-1-9-27-14/h1-2,9-12H,3-8H2,(H2,20,25)(H,21,26)
n/an/a 7.60n/an/an/an/an/an/a
Sirtris a GSK Company
Curated by ChEMBL
Assay Description
Inhibition of human His-tagged SIRT3 (102 to 399) expressed in Escherichia coli BL21(DE3) assessed as inhibition of deacetylation of Ac-RHKKAcW-NH2 s...
J Med Chem 56: 3666-79 (2013)
Article DOI: 10.1021/jm400204k
BindingDB Entry DOI: 10.7270/Q2D50P9C
NAD-Dependent Deacetylase Sirtuin-1
(Homo sapiens (Human))
BDBM50431116
(CHEMBL2332043)
Show SMILES NC(=O)c1cc2ncnc(N3CCC(CCNC(=O)c4cccs4)CC3)c2s1
Show InChI InChI=1S/C19H21N5O2S2/c20-17(25)15-10-13-16(28-15)18(23-11-22-13)24-7-4-12(5-8-24)3-6-21-19(26)14-2-1-9-27-14/h1-2,9-12H,3-8H2,(H2,20,25)(H,21,26)
NCI pathway
Reactome pathway
n/an/a 5.80n/an/an/an/an/an/a
Sirtris a GSK Company
Curated by ChEMBL
Assay Description
Inhibition of His-tagged SIRT1 (1 to 747) (unknown origin)-mediated deacetylation of Ac-RHKKAcW-NH2 substrate preincubated for 20 mins measured after...
J Med Chem 56: 3666-79 (2013)
Article DOI: 10.1021/jm400204k
BindingDB Entry DOI: 10.7270/Q2D50P9C
NAD-dependent deacetylase sirtuin 2
(Homo sapiens (Human))
BDBM50431116
(CHEMBL2332043)
Show SMILES NC(=O)c1cc2ncnc(N3CCC(CCNC(=O)c4cccs4)CC3)c2s1
Show InChI InChI=1S/C19H21N5O2S2/c20-17(25)15-10-13-16(28-15)18(23-11-22-13)24-7-4-12(5-8-24)3-6-21-19(26)14-2-1-9-27-14/h1-2,9-12H,3-8H2,(H2,20,25)(H,21,26)
NCI pathway
n/an/a 6.5n/an/an/an/an/an/a
Sirtris a GSK Company
Curated by ChEMBL
Assay Description
Inhibition of His-tagged SIRT2 (1 to 389) (unknown origin)-mediated deacetylation of Ac-RHKKAcW-NH2 substrate incubated for 20 mins prior to substrat...
J Med Chem 56: 3666-79 (2013)
Article DOI: 10.1021/jm400204k
BindingDB Entry DOI: 10.7270/Q2D50P9C