BDBM50431159 CHEMBL2332090
SMILES: COc1cc(CNC(=O)Nc2ccc(cc2)-c2cn[nH]c2)cc(OC)c1
InChI Key: InChIKey=OFTQPWXOUGAPLX-UHFFFAOYSA-N
Data: 3 IC50
Activity Spreadsheet -- Enzyme Inhibition Constant Data from BindingDB
Found 3 hits for monomerid = 50431159
Trg + Lig
Ki
nM
ΔG°
kcal/mole
IC50
nM
Kd
nM
EC50/IC50
nM
koff
s-1
kon
M-1s-1
pHTemp
°C
Rho-associated protein kinase 2
(Homo sapiens (Human))
BDBM50431159
(CHEMBL2332090)
Show SMILES COc1cc(CNC(=O)Nc2ccc(cc2)-c2cn[nH]c2)cc(OC)c1
Show InChI InChI=1S/C19H20N4O3/c1-25-17-7-13(8-18(9-17)26-2)10-20-19(24)23-16-5-3-14(4-6-16)15-11-21-22-12-15/h3-9,11-12H,10H2,1-2H3,(H,21,22)(H2,20,23,24)
n/an/a 281n/an/an/an/an/an/a
Shanghai Institute of Technology
Curated by ChEMBL
Assay Description
Inhibition of ROCK2 (unknown origin) using STK2 substrate after 4 hrs by HTRF mode
Bioorg Med Chem 23: 2505-17 (2015)
Article DOI: 10.1016/j.bmc.2015.03.047
BindingDB Entry DOI: 10.7270/Q2ZP47SX
Rho-associated protein kinase 2
(Homo sapiens (Human))
BDBM50431159
(CHEMBL2332090)
Show SMILES COc1cc(CNC(=O)Nc2ccc(cc2)-c2cn[nH]c2)cc(OC)c1
Show InChI InChI=1S/C19H20N4O3/c1-25-17-7-13(8-18(9-17)26-2)10-20-19(24)23-16-5-3-14(4-6-16)15-11-21-22-12-15/h3-9,11-12H,10H2,1-2H3,(H,21,22)(H2,20,23,24)
n/an/a 281n/an/an/an/an/an/a
The Scripps Research Institute
Curated by ChEMBL
Assay Description
Inhibition of ROCK2 (unknown origin) after 4 hrs by HTRF assay
J Med Chem 56: 3568-81 (2013)
Article DOI: 10.1021/jm400062r
BindingDB Entry DOI: 10.7270/Q28C9XMJ
Rho-associated protein kinase 2
(Homo sapiens (Human))
BDBM50431159
(CHEMBL2332090)
Show SMILES COc1cc(CNC(=O)Nc2ccc(cc2)-c2cn[nH]c2)cc(OC)c1
Show InChI InChI=1S/C19H20N4O3/c1-25-17-7-13(8-18(9-17)26-2)10-20-19(24)23-16-5-3-14(4-6-16)15-11-21-22-12-15/h3-9,11-12H,10H2,1-2H3,(H,21,22)(H2,20,23,24)
n/an/a 281n/an/an/an/an/an/a
Shanghai Institute of Technology
Curated by ChEMBL
Assay Description
Inhibition of ROCK2 (unknown origin) using STK2 substrate after 4 hrs by HTRF mode
Bioorg Med Chem 23: 2505-17 (2015)
Article DOI: 10.1016/j.bmc.2015.03.047
BindingDB Entry DOI: 10.7270/Q2ZP47SX