BDBM50431163 CHEMBL2332078
SMILES: O=C(NCCc1ccccc1)Nc1ccc(cc1)-c1cn[nH]c1
InChI Key: InChIKey=DWGJNYSMPHRXBP-UHFFFAOYSA-N
Data: 3 IC50
Activity Spreadsheet -- Enzyme Inhibition Constant Data from BindingDB
Found 3 hits for monomerid = 50431163
Trg + Lig
Ki
nM
ΔG°
kcal/mole
IC50
nM
Kd
nM
EC50/IC50
nM
koff
s-1
kon
M-1s-1
pHTemp
°C
Rho-associated protein kinase 2
(Homo sapiens (Human))
BDBM50431163
(CHEMBL2332078)
Show SMILES O=C(NCCc1ccccc1)Nc1ccc(cc1)-c1cn[nH]c1
Show InChI InChI=1S/C18H18N4O/c23-18(19-11-10-14-4-2-1-3-5-14)22-17-8-6-15(7-9-17)16-12-20-21-13-16/h1-9,12-13H,10-11H2,(H,20,21)(H2,19,22,23)
n/an/a 88n/an/an/an/an/an/a
Shanghai Institute of Technology
Curated by ChEMBL
Assay Description
Inhibition of ROCK2 (unknown origin) using STK2 substrate after 4 hrs by HTRF mode
Bioorg Med Chem 23: 2505-17 (2015)
Article DOI: 10.1016/j.bmc.2015.03.047
BindingDB Entry DOI: 10.7270/Q2ZP47SX
Rho-associated protein kinase 2
(Homo sapiens (Human))
BDBM50431163
(CHEMBL2332078)
Show SMILES O=C(NCCc1ccccc1)Nc1ccc(cc1)-c1cn[nH]c1
Show InChI InChI=1S/C18H18N4O/c23-18(19-11-10-14-4-2-1-3-5-14)22-17-8-6-15(7-9-17)16-12-20-21-13-16/h1-9,12-13H,10-11H2,(H,20,21)(H2,19,22,23)
n/an/a 88n/an/an/an/an/an/a
The Scripps Research Institute
Curated by ChEMBL
Assay Description
Inhibition of ROCK2 (unknown origin) after 4 hrs by HTRF assay
J Med Chem 56: 3568-81 (2013)
Article DOI: 10.1021/jm400062r
BindingDB Entry DOI: 10.7270/Q28C9XMJ
Rho-associated protein kinase 2
(Homo sapiens (Human))
BDBM50431163
(CHEMBL2332078)
Show SMILES O=C(NCCc1ccccc1)Nc1ccc(cc1)-c1cn[nH]c1
Show InChI InChI=1S/C18H18N4O/c23-18(19-11-10-14-4-2-1-3-5-14)22-17-8-6-15(7-9-17)16-12-20-21-13-16/h1-9,12-13H,10-11H2,(H,20,21)(H2,19,22,23)
n/an/a 88n/an/an/an/an/an/a
Shanghai Institute of Technology
Curated by ChEMBL
Assay Description
Inhibition of ROCK2 (unknown origin) using STK2 substrate after 4 hrs by HTRF mode
Bioorg Med Chem 23: 2505-17 (2015)
Article DOI: 10.1016/j.bmc.2015.03.047
BindingDB Entry DOI: 10.7270/Q2ZP47SX