BDBM50431175 CHEMBL2332100
SMILES: CCCCCCCC(=O)O[C@@H]1[C@@H](OC(=O)C(\C)=C/C)C(C)=C2[C@@H]3OC(=O)[C@@](C)(O)[C@@]3(OC(=O)CCC)[C@H](C[C@](C)(OC(C)=O)[C@@H]12)OC(=O)CCC
InChI Key: InChIKey=ARWTVHVQANENHV-OEPDNIQBSA-N
Data: 1 Kd
Activity Spreadsheet -- Enzyme Inhibition Constant Data from BindingDB
Found 1 hit for monomerid = 50431175
Trg + Lig
Ki
nM
ΔG°
kcal/mole
IC50
nM
Kd
nM
EC50/IC50
nM
koff
s-1
kon
M-1s-1
pHTemp
°C
Sarcoplasmic/endoplasmic reticulum calcium ATP-ase
(Oryctolagus cuniculus)
BDBM50431175
(CHEMBL2332100)
Show SMILES CCCCCCCC(=O)O[C@@H]1[C@@H](OC(=O)C(\C)=C/C)C(C)=C2[C@@H]3OC(=O)[C@@](C)(O)[C@@]3(OC(=O)CCC)[C@H](C[C@](C)(OC(C)=O)[C@@H]12)OC(=O)CCC |r,t:20|
Show InChI InChI=1S/C38H56O13/c1-10-14-15-16-17-20-27(41)47-32-30-29(23(6)31(32)48-34(43)22(5)13-4)33-38(51-28(42)19-12-3,37(9,45)35(44)49-33)25(46-26(40)18-11-2)21-36(30,8)50-24(7)39/h13,25,30-33,45H,10-12,14-21H2,1-9H3/b22-13-/t25-,30+,31-,32-,33-,36-,37+,38+/m0/s1
n/an/an/a 11n/an/an/an/an/a
University of Copenhagen
Curated by ChEMBL
Assay Description
Binding affinity to SERCA1a in sarcoplasmic reticulum vesicles of rabbit skeletal muscle after 2.5 to 6 mins by spectrophotometric analysis
J Med Chem 56: 3609-19 (2013)
Article DOI: 10.1021/jm4001083
BindingDB Entry DOI: 10.7270/Q20V8F4F