null
SMILES: CC(C)(C)NC(=O)c1c[nH]c2ncc(nc12)-c1n[nH]c2c(cccc12)C(C)(C)O
InChI Key: InChIKey=NLQOKMKYJKNJGC-UHFFFAOYSA-N
Activity Spreadsheet -- Enzyme Inhibition Constant Data from BindingDB
Found 5 hits for monomerid = 50431380
Trg + Lig
Ki
nM
ΔG°
kcal/mole
IC50
nM
Kd
nM
EC50/IC50
nM
koff
s-1
kon
M-1s-1
pHTemp
°C
Cytochrome P450 2D6
(Homo sapiens (Human))
BDBM50431380
(CHEMBL2347407)
Show SMILES CC(C)(C)NC(=O)c1c[nH]c2ncc(nc12)-c1n[nH]c2c(cccc12)C(C)(C)O
Show InChI InChI=1S/C21H24N6O2/c1-20(2,3)25-19(28)12-9-22-18-17(12)24-14(10-23-18)16-11-7-6-8-13(21(4,5)29)15(11)26-27-16/h6-10,29H,1-5H3,(H,22,23)(H,25,28)(H,26,27)
n/an/a 5.00E+3n/an/an/an/an/an/a
Hoffmann-La Roche Inc.
Curated by ChEMBL
Assay Description
Inhibition of CYP2D6 (unknown origin)
J Med Chem 56: 1677-92 (2013)
Article DOI: 10.1021/jm301720p
BindingDB Entry DOI: 10.7270/Q22N53M0
Potassium voltage-gated channel subfamily H member 2
(Homo sapiens (Human))
BDBM50431380
(CHEMBL2347407)
Show SMILES CC(C)(C)NC(=O)c1c[nH]c2ncc(nc12)-c1n[nH]c2c(cccc12)C(C)(C)O
Show InChI InChI=1S/C21H24N6O2/c1-20(2,3)25-19(28)12-9-22-18-17(12)24-14(10-23-18)16-11-7-6-8-13(21(4,5)29)15(11)26-27-16/h6-10,29H,1-5H3,(H,22,23)(H,25,28)(H,26,27)
Reactome pathway
n/an/a>2.00E+3n/an/an/an/an/an/a
Hoffmann-La Roche Inc.
Curated by ChEMBL
Assay Description
Inhibition of human ERG channel
J Med Chem 56: 1677-92 (2013)
Article DOI: 10.1021/jm301720p
BindingDB Entry DOI: 10.7270/Q22N53M0
Tyrosine-protein kinase SYK
(Homo sapiens (Human))
BDBM50431380
(CHEMBL2347407)
Show SMILES CC(C)(C)NC(=O)c1c[nH]c2ncc(nc12)-c1n[nH]c2c(cccc12)C(C)(C)O
Show InChI InChI=1S/C21H24N6O2/c1-20(2,3)25-19(28)12-9-22-18-17(12)24-14(10-23-18)16-11-7-6-8-13(21(4,5)29)15(11)26-27-16/h6-10,29H,1-5H3,(H,22,23)(H,25,28)(H,26,27)
NCI pathway
Reactome pathway
n/an/a 10n/an/an/an/an/an/a
Hoffmann-La Roche Inc.
Curated by ChEMBL
Assay Description
Inhibition of human recombinant truncated SYK (360 to 365 amino acid residues) using N-terminally biotinylated EPEGDYEEVLE peptide as substrate asses...
J Med Chem 56: 1677-92 (2013)
Article DOI: 10.1021/jm301720p
BindingDB Entry DOI: 10.7270/Q22N53M0
Tyrosine-protein kinase SYK
(Homo sapiens (Human))
BDBM50431380
(CHEMBL2347407)
Show SMILES CC(C)(C)NC(=O)c1c[nH]c2ncc(nc12)-c1n[nH]c2c(cccc12)C(C)(C)O
Show InChI InChI=1S/C21H24N6O2/c1-20(2,3)25-19(28)12-9-22-18-17(12)24-14(10-23-18)16-11-7-6-8-13(21(4,5)29)15(11)26-27-16/h6-10,29H,1-5H3,(H,22,23)(H,25,28)(H,26,27)
NCI pathway
Reactome pathway
n/an/a 534n/an/an/an/an/an/a
Hoffmann-La Roche Inc.
Curated by ChEMBL
Assay Description
Inhibition of SYK in human whole blood
J Med Chem 56: 1677-92 (2013)
Article DOI: 10.1021/jm301720p
BindingDB Entry DOI: 10.7270/Q22N53M0
Tyrosine-protein kinase SYK
(Homo sapiens (Human))
BDBM50431380
(CHEMBL2347407)
Show SMILES CC(C)(C)NC(=O)c1c[nH]c2ncc(nc12)-c1n[nH]c2c(cccc12)C(C)(C)O
Show InChI InChI=1S/C21H24N6O2/c1-20(2,3)25-19(28)12-9-22-18-17(12)24-14(10-23-18)16-11-7-6-8-13(21(4,5)29)15(11)26-27-16/h6-10,29H,1-5H3,(H,22,23)(H,25,28)(H,26,27)
NCI pathway
Reactome pathway
n/an/a 76n/an/an/an/an/an/a
Hoffmann-La Roche Inc.
Curated by ChEMBL
Assay Description
Inhibition of SYK in human Ramos cells
J Med Chem 56: 1677-92 (2013)
Article DOI: 10.1021/jm301720p
BindingDB Entry DOI: 10.7270/Q22N53M0