BDBM50431393 CHEMBL2348850
SMILES: COc1cc(cc(OC)c1OC)-c1cnc2[nH]cc(C(=O)NC(C)C)c2n1
InChI Key: InChIKey=WWUBOSRORWJGRU-UHFFFAOYSA-N
Data: 4 IC50
PDB links: 1 PDB ID matches this monomer.
Activity Spreadsheet -- Enzyme Inhibition Constant Data from BindingDB
Found 4 hits for monomerid = 50431393
Trg + Lig
Ki
nM
ΔG°
kcal/mole
IC50
nM
Kd
nM
EC50/IC50
nM
koff
s-1
kon
M-1s-1
pHTemp
°C
Tyrosine-protein kinase SYK
(Homo sapiens (Human))
BDBM50431393
(CHEMBL2348850)
Show SMILES COc1cc(cc(OC)c1OC)-c1cnc2[nH]cc(C(=O)NC(C)C)c2n1
Show InChI InChI=1S/C19H22N4O4/c1-10(2)22-19(24)12-8-20-18-16(12)23-13(9-21-18)11-6-14(25-3)17(27-5)15(7-11)26-4/h6-10H,1-5H3,(H,20,21)(H,22,24)
NCI pathway
Reactome pathway
n/an/a 14n/an/an/an/an/an/a
Hoffmann-La Roche Inc.
Curated by ChEMBL
Assay Description
Inhibition of human recombinant truncated SYK (360 to 365 amino acid residues) using N-terminally biotinylated EPEGDYEEVLE peptide as substrate asses...
J Med Chem 56: 1677-92 (2013)
Article DOI: 10.1021/jm301720p
BindingDB Entry DOI: 10.7270/Q22N53M0
3D
3D Structure (crystal)
Tyrosine-protein kinase SYK
(Homo sapiens (Human))
BDBM50431393
(CHEMBL2348850)
Show SMILES COc1cc(cc(OC)c1OC)-c1cnc2[nH]cc(C(=O)NC(C)C)c2n1
Show InChI InChI=1S/C19H22N4O4/c1-10(2)22-19(24)12-8-20-18-16(12)23-13(9-21-18)11-6-14(25-3)17(27-5)15(7-11)26-4/h6-10H,1-5H3,(H,20,21)(H,22,24)
NCI pathway
Reactome pathway
n/an/a 7.09E+3n/an/an/an/an/an/a
Hoffmann-La Roche Inc.
Curated by ChEMBL
Assay Description
Inhibition of SYK in human whole blood
J Med Chem 56: 1677-92 (2013)
Article DOI: 10.1021/jm301720p
BindingDB Entry DOI: 10.7270/Q22N53M0
3D
3D Structure (crystal)
Tyrosine-protein kinase SYK
(Homo sapiens (Human))
BDBM50431393
(CHEMBL2348850)
Show SMILES COc1cc(cc(OC)c1OC)-c1cnc2[nH]cc(C(=O)NC(C)C)c2n1
Show InChI InChI=1S/C19H22N4O4/c1-10(2)22-19(24)12-8-20-18-16(12)23-13(9-21-18)11-6-14(25-3)17(27-5)15(7-11)26-4/h6-10H,1-5H3,(H,20,21)(H,22,24)
NCI pathway
Reactome pathway
n/an/a 190n/an/an/an/an/an/a
Hoffmann-La Roche Inc.
Curated by ChEMBL
Assay Description
Inhibition of SYK in human Ramos cells
J Med Chem 56: 1677-92 (2013)
Article DOI: 10.1021/jm301720p
BindingDB Entry DOI: 10.7270/Q22N53M0
3D
3D Structure (crystal)
Cytochrome P450 2C9
(Homo sapiens (Human))
BDBM50431393
(CHEMBL2348850)
Show SMILES COc1cc(cc(OC)c1OC)-c1cnc2[nH]cc(C(=O)NC(C)C)c2n1
Show InChI InChI=1S/C19H22N4O4/c1-10(2)22-19(24)12-8-20-18-16(12)23-13(9-21-18)11-6-14(25-3)17(27-5)15(7-11)26-4/h6-10H,1-5H3,(H,20,21)(H,22,24)
Reactome pathway
n/an/a 1.60E+4n/an/an/an/an/an/a
Hoffmann-La Roche Inc.
Curated by ChEMBL
Assay Description
Inhibition of CYP2C9 (unknown origin)
J Med Chem 56: 1677-92 (2013)
Article DOI: 10.1021/jm301720p
BindingDB Entry DOI: 10.7270/Q22N53M0