BDBM50431394 CHEMBL2347998
SMILES: CC(C)(CO)NC(=O)c1c[nH]c2ncc(nc12)-n1ncc2ccc(Cl)cc12
InChI Key: InChIKey=DLZNMCBJFXGZOW-UHFFFAOYSA-N
Data: 3 IC50
Activity Spreadsheet -- Enzyme Inhibition Constant Data from BindingDB
Found 3 hits for monomerid = 50431394
Trg + Lig
Ki
nM
ΔG°
kcal/mole
IC50
nM
Kd
nM
EC50/IC50
nM
koff
s-1
kon
M-1s-1
pHTemp
°C
Tyrosine-protein kinase SYK
(Homo sapiens (Human))
BDBM50431394
(CHEMBL2347998)
Show SMILES CC(C)(CO)NC(=O)c1c[nH]c2ncc(nc12)-n1ncc2ccc(Cl)cc12
Show InChI InChI=1S/C18H17ClN6O2/c1-18(2,9-26)24-17(27)12-7-20-16-15(12)23-14(8-21-16)25-13-5-11(19)4-3-10(13)6-22-25/h3-8,26H,9H2,1-2H3,(H,20,21)(H,24,27)
NCI pathway
Reactome pathway
n/an/a 24n/an/an/an/an/an/a
Hoffmann-La Roche Inc.
Curated by ChEMBL
Assay Description
Inhibition of human recombinant truncated SYK (360 to 365 amino acid residues) using N-terminally biotinylated EPEGDYEEVLE peptide as substrate asses...
J Med Chem 56: 1677-92 (2013)
Article DOI: 10.1021/jm301720p
BindingDB Entry DOI: 10.7270/Q22N53M0
Tyrosine-protein kinase SYK
(Homo sapiens (Human))
BDBM50431394
(CHEMBL2347998)
Show SMILES CC(C)(CO)NC(=O)c1c[nH]c2ncc(nc12)-n1ncc2ccc(Cl)cc12
Show InChI InChI=1S/C18H17ClN6O2/c1-18(2,9-26)24-17(27)12-7-20-16-15(12)23-14(8-21-16)25-13-5-11(19)4-3-10(13)6-22-25/h3-8,26H,9H2,1-2H3,(H,20,21)(H,24,27)
NCI pathway
Reactome pathway
n/an/a 9.95E+3n/an/an/an/an/an/a
Hoffmann-La Roche Inc.
Curated by ChEMBL
Assay Description
Inhibition of SYK in human whole blood
J Med Chem 56: 1677-92 (2013)
Article DOI: 10.1021/jm301720p
BindingDB Entry DOI: 10.7270/Q22N53M0
Tyrosine-protein kinase SYK
(Homo sapiens (Human))
BDBM50431394
(CHEMBL2347998)
Show SMILES CC(C)(CO)NC(=O)c1c[nH]c2ncc(nc12)-n1ncc2ccc(Cl)cc12
Show InChI InChI=1S/C18H17ClN6O2/c1-18(2,9-26)24-17(27)12-7-20-16-15(12)23-14(8-21-16)25-13-5-11(19)4-3-10(13)6-22-25/h3-8,26H,9H2,1-2H3,(H,20,21)(H,24,27)
NCI pathway
Reactome pathway
n/an/a 132n/an/an/an/an/an/a
Hoffmann-La Roche Inc.
Curated by ChEMBL
Assay Description
Inhibition of SYK in human Ramos cells
J Med Chem 56: 1677-92 (2013)
Article DOI: 10.1021/jm301720p
BindingDB Entry DOI: 10.7270/Q22N53M0