BDBM50431810 CHEMBL2347061
SMILES: Cc1cccc2C(C(=O)Nc12)=C1SC(=S)NC1=O
InChI Key: InChIKey=YKPCAIZGCTXESO-UHFFFAOYSA-N
Data: 1 IC50
Activity Spreadsheet -- Enzyme Inhibition Constant Data from BindingDB
Found 1 hit for monomerid = 50431810
Trg + Lig
Ki
nM
ΔG°
kcal/mole
IC50
nM
Kd
nM
EC50/IC50
nM
koff
s-1
kon
M-1s-1
pHTemp
°C
Ribosomal protein S6 kinase alpha-3
(Homo sapiens (Human))
BDBM50431810
(CHEMBL2347061)
Show SMILES Cc1cccc2C(C(=O)Nc12)=C1SC(=S)NC1=O |w:6.5|
Show InChI InChI=1S/C12H8N2O2S2/c1-5-3-2-4-6-7(10(15)13-8(5)6)9-11(16)14-12(17)18-9/h2-4H,1H3,(H,13,15)(H,14,16,17)
Reactome pathway
n/an/a 1.68E+3n/an/an/an/an/an/a
East China University of Science and Technology
Curated by ChEMBL
Assay Description
Inhibition of RSK2 (unknown origin) using AKRRRLSSLRA as substrate after 60 mins by fluorescence assay
Bioorg Med Chem 21: 1724-34 (2013)
Article DOI: 10.1016/j.bmc.2013.01.047
BindingDB Entry DOI: 10.7270/Q2GQ704N