BDBM50431926 CHEMBL2348082
SMILES: CC(C)c1sc(\C=C2/NC(=O)CS2)nc1-c1ccccc1
InChI Key: InChIKey=GCEOSQNOFSFJIN-MDWZMJQESA-N
Data: 1 IC50
Activity Spreadsheet -- Enzyme Inhibition Constant Data from BindingDB
Found 1 hit for monomerid = 50431926
Trg + Lig
Ki
nM
ΔG°
kcal/mole
IC50
nM
Kd
nM
EC50/IC50
nM
koff
s-1
kon
M-1s-1
pHTemp
°C
A disintegrin and metalloproteinase with thrombospondin motifs 5 (ADAMTS-5)
(Homo sapiens (Human))
BDBM50431926
(CHEMBL2348082)
Show SMILES CC(C)c1sc(\C=C2/NC(=O)CS2)nc1-c1ccccc1
Show InChI InChI=1S/C16H16N2OS2/c1-10(2)16-15(11-6-4-3-5-7-11)18-14(21-16)8-13-17-12(19)9-20-13/h3-8,10H,9H2,1-2H3,(H,17,19)/b13-8+
Reactome pathway
n/an/a 830n/an/an/an/an/an/a
Asahi Kasei Pharma Corporation
Curated by ChEMBL
Assay Description
Inhibition of human His-tagged ADAMTS-5 using QF-peptide as substrate by FRET method
Bioorg Med Chem Lett 23: 2106-10 (2013)
Article DOI: 10.1016/j.bmcl.2013.01.121
BindingDB Entry DOI: 10.7270/Q26974ZF