BDBM50431949 CHEMBL2348090
SMILES: OC(=O)CCc1sc(\C=C2/NC(=O)CS2)nc1-c1sccc1Br
InChI Key: InChIKey=MWEVEYGFEQRSOB-BJMVGYQFSA-N
Data: 1 IC50
Activity Spreadsheet -- Enzyme Inhibition Constant Data from BindingDB
Found 1 hit for monomerid = 50431949
Trg + Lig
Ki
nM
ΔG°
kcal/mole
IC50
nM
Kd
nM
EC50/IC50
nM
koff
s-1
kon
M-1s-1
pHTemp
°C
A disintegrin and metalloproteinase with thrombospondin motifs 5 (ADAMTS-5)
(Homo sapiens (Human))
BDBM50431949
(CHEMBL2348090)
Show SMILES OC(=O)CCc1sc(\C=C2/NC(=O)CS2)nc1-c1sccc1Br
Show InChI InChI=1S/C14H11BrN2O3S3/c15-7-3-4-21-14(7)13-8(1-2-12(19)20)23-11(17-13)5-10-16-9(18)6-22-10/h3-5H,1-2,6H2,(H,16,18)(H,19,20)/b10-5+
Reactome pathway
n/an/a 420n/an/an/an/an/an/a
Asahi Kasei Pharma Corporation
Curated by ChEMBL
Assay Description
Inhibition of human His-tagged ADAMTS-5 using QF-peptide as substrate by FRET method
Bioorg Med Chem Lett 23: 2106-10 (2013)
Article DOI: 10.1016/j.bmcl.2013.01.121
BindingDB Entry DOI: 10.7270/Q26974ZF