BDBM50431998 CHEMBL2348745
SMILES: CC(=O)Nc1n[nH]c(=O)c2ccccc12
InChI Key: InChIKey=SBENBKBGEBCBOQ-UHFFFAOYSA-N
Data: 3 IC50
Activity Spreadsheet -- Enzyme Inhibition Constant Data from BindingDB
Found 3 hits for monomerid = 50431998
Trg + Lig
Ki
nM
ΔG°
kcal/mole
IC50
nM
Kd
nM
EC50/IC50
nM
koff
s-1
kon
M-1s-1
pHTemp
°C
Cyclin-Dependent Kinase 5 (CDK5)
(Homo sapiens (Human))
BDBM50431998
(CHEMBL2348745)
Show SMILES CC(=O)Nc1n[nH]c(=O)c2ccccc12
Show InChI InChI=1S/C10H9N3O2/c1-6(14)11-9-7-4-2-3-5-8(7)10(15)13-12-9/h2-5H,1H3,(H,13,15)(H,11,12,14)
NCI pathway
Reactome pathway
n/an/a>1.00E+4n/an/an/an/an/an/a
Universit£ de Strasbourg
Curated by ChEMBL
Assay Description
Inhibition of human recombinant CDK5/p25 after 30 mins by scintillation counting analysis in presence of [gamma-33P]ATP
Bioorg Med Chem Lett 23: 2007-13 (2013)
Article DOI: 10.1016/j.bmcl.2013.02.027
BindingDB Entry DOI: 10.7270/Q2T1551T
Dual-specificity tyrosine-(Y)-phosphorylation regulated kinase 1A
(RAT)
BDBM50431998
(CHEMBL2348745)
Show SMILES CC(=O)Nc1n[nH]c(=O)c2ccccc12
Show InChI InChI=1S/C10H9N3O2/c1-6(14)11-9-7-4-2-3-5-8(7)10(15)13-12-9/h2-5H,1H3,(H,13,15)(H,11,12,14)
n/an/a>1.00E+4n/an/an/an/an/an/a
Universit£ de Strasbourg
Curated by ChEMBL
Assay Description
Inhibition of rat recombinant DYRK1A expressed in Escherichia coli using myelin basic protein as substrate after 30 mins by scintillation counting an...
Bioorg Med Chem Lett 23: 2007-13 (2013)
Article DOI: 10.1016/j.bmcl.2013.02.027
BindingDB Entry DOI: 10.7270/Q2T1551T
Casein kinase I isoform alpha
(Sus scrofa)
BDBM50431998
(CHEMBL2348745)
Show SMILES CC(=O)Nc1n[nH]c(=O)c2ccccc12
Show InChI InChI=1S/C10H9N3O2/c1-6(14)11-9-7-4-2-3-5-8(7)10(15)13-12-9/h2-5H,1H3,(H,13,15)(H,11,12,14)
n/an/a>1.00E+4n/an/an/an/an/an/a
Universit£ de Strasbourg
Curated by ChEMBL
Assay Description
Inhibition of pig brain CK1 using RRKHAAIGpSAYSITA as substrate after 30 mins by scintillation counting analysis in presence of [gamma-33P]ATP
Bioorg Med Chem Lett 23: 2007-13 (2013)
Article DOI: 10.1016/j.bmcl.2013.02.027
BindingDB Entry DOI: 10.7270/Q2T1551T