BDBM50432118 CHEMBL2349604
SMILES: Cc1cc(on1)-c1cccc(NC(=O)N(CCC(c2ccccc2)c2ccccc2)CCN2CCOCC2)c1
InChI Key: InChIKey=PPVDIZHHQWCLTQ-UHFFFAOYSA-N
Data: 1 EC50
Activity Spreadsheet -- Enzyme Inhibition Constant Data from BindingDB
Found 1 hit for monomerid = 50432118
Trg + Lig
Ki
nM
ΔG°
kcal/mole
IC50
nM
Kd
nM
EC50/IC50
nM
koff
s-1
kon
M-1s-1
pHTemp
°C
Calcium-sensing receptor (CaSR)
(Homo sapiens (Human))
BDBM50432118
(CHEMBL2349604)
Show SMILES Cc1cc(on1)-c1cccc(NC(=O)N(CCC(c2ccccc2)c2ccccc2)CCN2CCOCC2)c1
Show InChI InChI=1S/C32H36N4O3/c1-25-23-31(39-34-25)28-13-8-14-29(24-28)33-32(37)36(18-17-35-19-21-38-22-20-35)16-15-30(26-9-4-2-5-10-26)27-11-6-3-7-12-27/h2-14,23-24,30H,15-22H2,1H3,(H,33,37)
n/an/an/an/a 150n/an/an/an/a
Galapagos SASU
Curated by ChEMBL
Assay Description
Positive allosteric modulation of human CaSR transfected in CHO cells after 5 hrs by luciferase reporter gene assay
Bioorg Med Chem Lett 23: 2451-4 (2013)
Article DOI: 10.1016/j.bmcl.2013.01.078
BindingDB Entry DOI: 10.7270/Q2930VJZ