BDBM50432123 CHEMBL2349599
SMILES: CN(C)c1cccc(NC(=O)N(CCC(c2ccccc2)c2ccccc2)CCN2CCOCC2)c1
InChI Key: InChIKey=GTPZZWVVIWMTIK-UHFFFAOYSA-N
Data: 1 EC50
Activity Spreadsheet -- Enzyme Inhibition Constant Data from BindingDB
Found 1 hit for monomerid = 50432123
Trg + Lig
Ki
nM
ΔG°
kcal/mole
IC50
nM
Kd
nM
EC50/IC50
nM
koff
s-1
kon
M-1s-1
pHTemp
°C
Calcium-sensing receptor (CaSR)
(Homo sapiens (Human))
BDBM50432123
(CHEMBL2349599)
Show SMILES CN(C)c1cccc(NC(=O)N(CCC(c2ccccc2)c2ccccc2)CCN2CCOCC2)c1
Show InChI InChI=1S/C30H38N4O2/c1-32(2)28-15-9-14-27(24-28)31-30(35)34(19-18-33-20-22-36-23-21-33)17-16-29(25-10-5-3-6-11-25)26-12-7-4-8-13-26/h3-15,24,29H,16-23H2,1-2H3,(H,31,35)
n/an/an/an/a 300n/an/an/an/a
Galapagos SASU
Curated by ChEMBL
Assay Description
Positive allosteric modulation of human CaSR transfected in CHO cells after 5 hrs by luciferase reporter gene assay
Bioorg Med Chem Lett 23: 2451-4 (2013)
Article DOI: 10.1016/j.bmcl.2013.01.078
BindingDB Entry DOI: 10.7270/Q2930VJZ