BDBM50432155 CHEMBL2346779
SMILES: COc1ccc(CNC(=O)NCCC(c2ccccc2)c2ccccc2)cc1
InChI Key: InChIKey=XJMXJAJDYAMOSN-UHFFFAOYSA-N
Data: 1 EC50
Activity Spreadsheet -- Enzyme Inhibition Constant Data from BindingDB
Found 1 hit for monomerid = 50432155
Trg + Lig
Ki
nM
ΔG°
kcal/mole
IC50
nM
Kd
nM
EC50/IC50
nM
koff
s-1
kon
M-1s-1
pHTemp
°C
Calcium-sensing receptor (CaSR)
(Homo sapiens (Human))
BDBM50432155
(CHEMBL2346779)
Show SMILES COc1ccc(CNC(=O)NCCC(c2ccccc2)c2ccccc2)cc1
Show InChI InChI=1S/C24H26N2O2/c1-28-22-14-12-19(13-15-22)18-26-24(27)25-17-16-23(20-8-4-2-5-9-20)21-10-6-3-7-11-21/h2-15,23H,16-18H2,1H3,(H2,25,26,27)
n/an/an/an/a 1.50E+4n/an/an/an/a
Galapagos SASU
Curated by ChEMBL
Assay Description
Positive allosteric modulation of human CaSR transfected in CHO cells after 5 hrs by luciferase reporter gene assay
Bioorg Med Chem Lett 23: 2451-4 (2013)
Article DOI: 10.1016/j.bmcl.2013.01.078
BindingDB Entry DOI: 10.7270/Q2930VJZ