BDBM50432160 CHEMBL2346775
SMILES: O=C(NCCC(c1ccccc1)c1ccccc1)Nc1cccc(c1)-c1ccccc1
InChI Key: InChIKey=KMQJVXCGILREEY-UHFFFAOYSA-N
Data: 1 EC50
Activity Spreadsheet -- Enzyme Inhibition Constant Data from BindingDB
Found 1 hit for monomerid = 50432160
Trg + Lig
Ki
nM
ΔG°
kcal/mole
IC50
nM
Kd
nM
EC50/IC50
nM
koff
s-1
kon
M-1s-1
pHTemp
°C
Calcium-sensing receptor (CaSR)
(Homo sapiens (Human))
BDBM50432160
(CHEMBL2346775)
Show SMILES O=C(NCCC(c1ccccc1)c1ccccc1)Nc1cccc(c1)-c1ccccc1
Show InChI InChI=1S/C28H26N2O/c31-28(30-26-18-10-17-25(21-26)22-11-4-1-5-12-22)29-20-19-27(23-13-6-2-7-14-23)24-15-8-3-9-16-24/h1-18,21,27H,19-20H2,(H2,29,30,31)
n/an/an/an/a 1.50E+4n/an/an/an/a
Galapagos SASU
Curated by ChEMBL
Assay Description
Positive allosteric modulation of human CaSR transfected in CHO cells after 5 hrs by luciferase reporter gene assay
Bioorg Med Chem Lett 23: 2451-4 (2013)
Article DOI: 10.1016/j.bmcl.2013.01.078
BindingDB Entry DOI: 10.7270/Q2930VJZ