BDBM50432163 CHEMBL2346772
SMILES: CCOC(=O)c1ccc(NC(=O)NCCC(c2ccccc2)c2ccccc2)cc1
InChI Key: InChIKey=WHQVNXYNPXRVMQ-UHFFFAOYSA-N
Data: 1 EC50
Activity Spreadsheet -- Enzyme Inhibition Constant Data from BindingDB
Found 1 hit for monomerid = 50432163
Trg + Lig
Ki
nM
ΔG°
kcal/mole
IC50
nM
Kd
nM
EC50/IC50
nM
koff
s-1
kon
M-1s-1
pHTemp
°C
Calcium-sensing receptor (CaSR)
(Homo sapiens (Human))
BDBM50432163
(CHEMBL2346772)
Show SMILES CCOC(=O)c1ccc(NC(=O)NCCC(c2ccccc2)c2ccccc2)cc1
Show InChI InChI=1S/C25H26N2O3/c1-2-30-24(28)21-13-15-22(16-14-21)27-25(29)26-18-17-23(19-9-5-3-6-10-19)20-11-7-4-8-12-20/h3-16,23H,2,17-18H2,1H3,(H2,26,27,29)
n/an/an/an/a 3.00E+3n/an/an/an/a
Galapagos SASU
Curated by ChEMBL
Assay Description
Positive allosteric modulation of human CaSR transfected in CHO cells after 5 hrs by luciferase reporter gene assay
Bioorg Med Chem Lett 23: 2451-4 (2013)
Article DOI: 10.1016/j.bmcl.2013.01.078
BindingDB Entry DOI: 10.7270/Q2930VJZ