BDBM50432166 CHEMBL2346769
SMILES: Clc1ccc(NC(=O)NCCC(c2ccccc2)c2ccccc2)cc1
InChI Key: InChIKey=FVVUFTXFMCPUAO-UHFFFAOYSA-N
Data: 1 EC50
Activity Spreadsheet -- Enzyme Inhibition Constant Data from BindingDB
Found 1 hit for monomerid = 50432166
Trg + Lig
Ki
nM
ΔG°
kcal/mole
IC50
nM
Kd
nM
EC50/IC50
nM
koff
s-1
kon
M-1s-1
pHTemp
°C
Calcium-sensing receptor (CaSR)
(Homo sapiens (Human))
BDBM50432166
(CHEMBL2346769)
Show SMILES Clc1ccc(NC(=O)NCCC(c2ccccc2)c2ccccc2)cc1
Show InChI InChI=1S/C22H21ClN2O/c23-19-11-13-20(14-12-19)25-22(26)24-16-15-21(17-7-3-1-4-8-17)18-9-5-2-6-10-18/h1-14,21H,15-16H2,(H2,24,25,26)
n/an/an/an/a 4.00E+3n/an/an/an/a
Galapagos SASU
Curated by ChEMBL
Assay Description
Positive allosteric modulation of human CaSR transfected in CHO cells after 5 hrs by luciferase reporter gene assay
Bioorg Med Chem Lett 23: 2451-4 (2013)
Article DOI: 10.1016/j.bmcl.2013.01.078
BindingDB Entry DOI: 10.7270/Q2930VJZ