BDBM50432173 CHEMBL2346802
SMILES: CC1(C)Cc2cc(Cl)ccc2C(N[C@@H](Cc2ccccc2)c2ncc(C#N)c(=O)[nH]2)=N1
InChI Key: InChIKey=SSQLUPVACAMCTQ-FQEVSTJZSA-N
Data: 1 IC50
Activity Spreadsheet -- Enzyme Inhibition Constant Data from BindingDB
Found 1 hit for monomerid = 50432173
Trg + Lig
Ki
nM
ΔG°
kcal/mole
IC50
nM
Kd
nM
EC50/IC50
nM
koff
s-1
kon
M-1s-1
pHTemp
°C
Beta-secretase 1
(Homo sapiens (Human))
BDBM50432173
(CHEMBL2346802)
Show SMILES CC1(C)Cc2cc(Cl)ccc2C(N[C@@H](Cc2ccccc2)c2ncc(C#N)c(=O)[nH]2)=N1 |r,c:32|
Show InChI InChI=1S/C24H22ClN5O/c1-24(2)12-16-11-18(25)8-9-19(16)21(30-24)28-20(10-15-6-4-3-5-7-15)22-27-14-17(13-26)23(31)29-22/h3-9,11,14,20H,10,12H2,1-2H3,(H,28,30)(H,27,29,31)/t20-/m0/s1
n/an/a 470n/an/an/an/an/an/a
Elan Pharmaceuticals
Curated by ChEMBL
Assay Description
Inhibition of BACE-1 (unknown origin) by alpha screen assay
Bioorg Med Chem Lett 23: 2181-6 (2013)
Article DOI: 10.1016/j.bmcl.2013.01.103
BindingDB Entry DOI: 10.7270/Q25B03WH