BDBM50432175 CHEMBL2346800
SMILES: CC1(C)Cc2cc(Cl)ccc2C(N[C@@H](Cc2ccccc2)c2nc3ccncc3c(=O)[nH]2)=N1
InChI Key: InChIKey=DQYKHJYAOKSEPD-QFIPXVFZSA-N
Data: 1 IC50
Activity Spreadsheet -- Enzyme Inhibition Constant Data from BindingDB
Found 1 hit for monomerid = 50432175
Trg + Lig
Ki
nM
ΔG°
kcal/mole
IC50
nM
Kd
nM
EC50/IC50
nM
koff
s-1
kon
M-1s-1
pHTemp
°C
Beta-secretase 1
(Homo sapiens (Human))
BDBM50432175
(CHEMBL2346800)
Show SMILES CC1(C)Cc2cc(Cl)ccc2C(N[C@@H](Cc2ccccc2)c2nc3ccncc3c(=O)[nH]2)=N1 |r,c:35|
Show InChI InChI=1S/C26H24ClN5O/c1-26(2)14-17-13-18(27)8-9-19(17)23(32-26)30-22(12-16-6-4-3-5-7-16)24-29-21-10-11-28-15-20(21)25(33)31-24/h3-11,13,15,22H,12,14H2,1-2H3,(H,30,32)(H,29,31,33)/t22-/m0/s1
n/an/a 170n/an/an/an/an/an/a
Elan Pharmaceuticals
Curated by ChEMBL
Assay Description
Inhibition of BACE-1 (unknown origin) by alpha screen assay
Bioorg Med Chem Lett 23: 2181-6 (2013)
Article DOI: 10.1016/j.bmcl.2013.01.103
BindingDB Entry DOI: 10.7270/Q25B03WH