BDBM50432400 CHEMBL2348990
SMILES: Cc1cc(C(=O)Nc2cc(Oc3ccc4nc(NC(=O)C5CC5)cn4n3)ccc2Cl)n(C)n1
InChI Key: InChIKey=DBUIDELURWLCSA-UHFFFAOYSA-N
Data: 1 IC50
Activity Spreadsheet -- Enzyme Inhibition Constant Data from BindingDB
Found 1 hit for monomerid = 50432400
Trg + Lig
Ki
nM
ΔG°
kcal/mole
IC50
nM
Kd
nM
EC50/IC50
nM
koff
s-1
kon
M-1s-1
pHTemp
°C
Vascular endothelial growth factor receptor 2
(Homo sapiens (Human))
BDBM50432400
(CHEMBL2348990)
Show SMILES Cc1cc(C(=O)Nc2cc(Oc3ccc4nc(NC(=O)C5CC5)cn4n3)ccc2Cl)n(C)n1
Show InChI InChI=1S/C22H20ClN7O3/c1-12-9-17(29(2)27-12)22(32)24-16-10-14(5-6-15(16)23)33-20-8-7-19-25-18(11-30(19)28-20)26-21(31)13-3-4-13/h5-11,13H,3-4H2,1-2H3,(H,24,32)(H,26,31)
NCI pathway
Reactome pathway
n/an/a 1.30n/an/an/an/an/an/a
Takeda Pharmaceutical Company Limited
Curated by ChEMBL
Assay Description
Inhibition of VEGFR2 (unknown origin) using biotinylated poly(Glu:Tyr) as substrate after 5 mins by AlphaScreen assay in presence of 10 uM of ATP
Bioorg Med Chem 21: 2333-45 (2013)
Article DOI: 10.1016/j.bmc.2013.01.074
BindingDB Entry DOI: 10.7270/Q22B90C1