BDBM50432404 CHEMBL2348994
SMILES: Cc1cc(C(=O)Nc2ccc(C)c(Oc3ccc4nc(NC(=O)C5CC5)cn4n3)c2)n(C)n1
InChI Key: InChIKey=PORBJAAHGWZDRB-UHFFFAOYSA-N
Data: 1 IC50
Activity Spreadsheet -- Enzyme Inhibition Constant Data from BindingDB
Found 1 hit for monomerid = 50432404
Trg + Lig
Ki
nM
ΔG°
kcal/mole
IC50
nM
Kd
nM
EC50/IC50
nM
koff
s-1
kon
M-1s-1
pHTemp
°C
Vascular endothelial growth factor receptor 2
(Homo sapiens (Human))
BDBM50432404
(CHEMBL2348994)
Show SMILES Cc1cc(C(=O)Nc2ccc(C)c(Oc3ccc4nc(NC(=O)C5CC5)cn4n3)c2)n(C)n1
Show InChI InChI=1S/C23H23N7O3/c1-13-4-7-16(24-23(32)17-10-14(2)27-29(17)3)11-18(13)33-21-9-8-20-25-19(12-30(20)28-21)26-22(31)15-5-6-15/h4,7-12,15H,5-6H2,1-3H3,(H,24,32)(H,26,31)
NCI pathway
Reactome pathway
n/an/a 1.80n/an/an/an/an/an/a
Takeda Pharmaceutical Company Limited
Curated by ChEMBL
Assay Description
Inhibition of VEGFR2 (unknown origin) using biotinylated poly(Glu:Tyr) as substrate after 5 mins by AlphaScreen assay in presence of 10 uM of ATP
Bioorg Med Chem 21: 2333-45 (2013)
Article DOI: 10.1016/j.bmc.2013.01.074
BindingDB Entry DOI: 10.7270/Q22B90C1