BDBM50432406 CHEMBL2348995
SMILES: Cc1cc(C(=O)Nc2cccc(Oc3ccc4nc(NC(=O)C5CC5)cn4n3)c2)n(n1)-c1ccccc1
InChI Key: InChIKey=MSDKNGQNNUUFPP-UHFFFAOYSA-N
Data: 1 IC50
Activity Spreadsheet -- Enzyme Inhibition Constant Data from BindingDB
Found 1 hit for monomerid = 50432406
Trg + Lig
Ki
nM
ΔG°
kcal/mole
IC50
nM
Kd
nM
EC50/IC50
nM
koff
s-1
kon
M-1s-1
pHTemp
°C
Vascular endothelial growth factor receptor 2
(Homo sapiens (Human))
BDBM50432406
(CHEMBL2348995)
Show SMILES Cc1cc(C(=O)Nc2cccc(Oc3ccc4nc(NC(=O)C5CC5)cn4n3)c2)n(n1)-c1ccccc1
Show InChI InChI=1S/C27H23N7O3/c1-17-14-22(34(31-17)20-7-3-2-4-8-20)27(36)28-19-6-5-9-21(15-19)37-25-13-12-24-29-23(16-33(24)32-25)30-26(35)18-10-11-18/h2-9,12-16,18H,10-11H2,1H3,(H,28,36)(H,30,35)
NCI pathway
Reactome pathway
n/an/a 1.20n/an/an/an/an/an/a
Takeda Pharmaceutical Company Limited
Curated by ChEMBL
Assay Description
Inhibition of VEGFR2 (unknown origin) using biotinylated poly(Glu:Tyr) as substrate after 5 mins by AlphaScreen assay in presence of 10 uM of ATP
Bioorg Med Chem 21: 2333-45 (2013)
Article DOI: 10.1016/j.bmc.2013.01.074
BindingDB Entry DOI: 10.7270/Q22B90C1