BDBM50432574 CHEMBL2347169
SMILES: NCCSCCCc1c[nH]c2ccc(F)cc12
InChI Key: InChIKey=IMWXQBHCDQKRPJ-UHFFFAOYSA-N
Data: 1 KI  2 IC50
Activity Spreadsheet -- Enzyme Inhibition Constant Data from BindingDB
Found 3 hits for monomerid = 50432574
Trg + Lig
Ki
nM
ΔG°
kcal/mole
IC50
nM
Kd
nM
EC50/IC50
nM
koff
s-1
kon
M-1s-1
pHTemp
°C
Sodium-dependent serotonin transporter
(Homo sapiens (Human))
BDBM50432574
(CHEMBL2347169)
Show SMILES NCCSCCCc1c[nH]c2ccc(F)cc12
Show InChI InChI=1S/C13H17FN2S/c14-11-3-4-13-12(8-11)10(9-16-13)2-1-6-17-7-5-15/h3-4,8-9,16H,1-2,5-7,15H2
0.900n/an/an/an/an/an/an/an/a
Universit£ Libre de Bruxelles
Curated by ChEMBL
Assay Description
Inhibition of serotonin reuptake at human SERT expressed in HEK293 cells coexpressing macrophage scavenger receptor
J Med Chem 56: 3943-58 (2013)
Article DOI: 10.1021/jm4001538
BindingDB Entry DOI: 10.7270/Q21C1Z7T
Myeloperoxidase (MPO)
(Homo sapiens (Human))
BDBM50432574
(CHEMBL2347169)
Show SMILES NCCSCCCc1c[nH]c2ccc(F)cc12
Show InChI InChI=1S/C13H17FN2S/c14-11-3-4-13-12(8-11)10(9-16-13)2-1-6-17-7-5-15/h3-4,8-9,16H,1-2,5-7,15H2
n/an/a 35n/an/an/an/an/an/a
Universit£ Libre de Bruxelles
Curated by ChEMBL
Assay Description
Inhibition of human recombinant MPO-mediated taurine chlorination after 5 mins by microplate assay
J Med Chem 56: 3943-58 (2013)
Article DOI: 10.1021/jm4001538
BindingDB Entry DOI: 10.7270/Q21C1Z7T
Myeloperoxidase (MPO)
(Homo sapiens (Human))
BDBM50432574
(CHEMBL2347169)
Show SMILES NCCSCCCc1c[nH]c2ccc(F)cc12
Show InChI InChI=1S/C13H17FN2S/c14-11-3-4-13-12(8-11)10(9-16-13)2-1-6-17-7-5-15/h3-4,8-9,16H,1-2,5-7,15H2
n/an/a 21n/an/an/an/an/an/a
Universit£ Libre de Bruxelles
Curated by ChEMBL
Assay Description
Inhibition of human recombinant MPO-mediated LDL oxidation after 5 mins by ELISA
J Med Chem 56: 3943-58 (2013)
Article DOI: 10.1021/jm4001538
BindingDB Entry DOI: 10.7270/Q21C1Z7T