null
SMILES: CC(C)[C@H](NC(=O)N(C)Cc1csc(n1)C(C)C)C(=O)N[C@H](CC[C@H](Cc1ccccc1)NC(=O)OCc1cnco1)Cc1ccccc1
InChI Key: InChIKey=ZBUUPRZMJYAPQF-QSCLJHCWSA-N
PDB links: 1 PDB ID matches this monomer.
Activity Spreadsheet -- Enzyme Inhibition Constant Data from BindingDB
Found 1 hit for monomerid = 50432594
Trg + Lig
Ki
nM
ΔG°
kcal/mole
IC50
nM
Kd
nM
EC50/IC50
nM
koff
s-1
kon
M-1s-1
pHTemp
°C
Cytochrome P450 3A4
(Homo sapiens (Human))
BDBM50432594
(CHEMBL2347184)
Show SMILES CC(C)[C@H](NC(=O)N(C)Cc1csc(n1)C(C)C)C(=O)N[C@H](CC[C@H](Cc1ccccc1)NC(=O)OCc1cnco1)Cc1ccccc1 |r|
Show InChI InChI=1S/C37H48N6O5S/c1-25(2)33(42-36(45)43(5)21-31-23-49-35(40-31)26(3)4)34(44)39-29(18-27-12-8-6-9-13-27)16-17-30(19-28-14-10-7-11-15-28)41-37(46)47-22-32-20-38-24-48-32/h6-15,20,23-26,29-30,33H,16-19,21-22H2,1-5H3,(H,39,44)(H,41,46)(H,42,45)/t29-,30-,33+/m1/s1
Reactome pathway
n/an/a 3.40E+3n/an/an/an/an/an/a
University of California
Curated by ChEMBL
Assay Description
Inhibition of C-terminal His-tagged wild type CYP3A4 (unknown origin)-mediated hydroxylation of 7-benzyloxy-4-trifluoromethylcoumarin expressed in Es...
J Med Chem 56: 3733-41 (2013)
Article DOI: 10.1021/jm400288z
BindingDB Entry DOI: 10.7270/Q2WM1FSZ
3D
3D Structure (crystal)