BDBM50432686 CHEMBL2347963
SMILES: CN(C)CCC(=O)Nc1cccc(c1)-c1c(oc2ncnc(N[C@H](CO)c3ccccc3)c12)-c1ccccc1
InChI Key: InChIKey=ASCVQXWPIHGQIB-RUZDIDTESA-N
Data: 1 IC50
PDB links: 1 PDB ID matches this monomer.
Activity Spreadsheet -- Enzyme Inhibition Constant Data from BindingDB
Found 1 hit for monomerid = 50432686
Trg + Lig
Ki
nM
ΔG°
kcal/mole
IC50
nM
Kd
nM
EC50/IC50
nM
koff
s-1
kon
M-1s-1
pHTemp
°C
Epidermal growth factor receptor
(Homo sapiens (Human))
BDBM50432686
(CHEMBL2347963)
Show SMILES CN(C)CCC(=O)Nc1cccc(c1)-c1c(oc2ncnc(N[C@H](CO)c3ccccc3)c12)-c1ccccc1 |r|
Show InChI InChI=1S/C31H31N5O3/c1-36(2)17-16-26(38)34-24-15-9-14-23(18-24)27-28-30(35-25(19-37)21-10-5-3-6-11-21)32-20-33-31(28)39-29(27)22-12-7-4-8-13-22/h3-15,18,20,25,37H,16-17,19H2,1-2H3,(H,34,38)(H,32,33,35)/t25-/m1/s1
n/an/a 8n/an/an/an/an/an/a
National Health Research Institutes
Curated by ChEMBL
Assay Description
Inhibition of human wild type GST-tagged EGFR kinase domain expressed in Sf9 cells by luminescence assay
J Med Chem 56: 3889-903 (2013)
Article DOI: 10.1021/jm400072p
BindingDB Entry DOI: 10.7270/Q27W6DJ5
3D
3D Structure (crystal)