BDBM50432842 CHEMBL2376225
SMILES: CN(C)C(=O)n1nnc(n1)-c1ccc(cc1)-n1c(C)ccc1C
InChI Key: InChIKey=IOHQEWJUXVBZPO-UHFFFAOYSA-N
Data: 2 IC50
Activity Spreadsheet -- Enzyme Inhibition Constant Data from BindingDB
Found 2 hits for monomerid = 50432842
Trg + Lig
Ki
nM
ΔG°
kcal/mole
IC50
nM
Kd
nM
EC50/IC50
nM
koff
s-1
kon
M-1s-1
pHTemp
°C
Fatty-acid amide hydrolase 1 (aa 30-579)
(Rattus norvegicus (rat))
BDBM50432842
(CHEMBL2376225)
Show SMILES CN(C)C(=O)n1nnc(n1)-c1ccc(cc1)-n1c(C)ccc1C
Show InChI InChI=1S/C16H18N6O/c1-11-5-6-12(2)21(11)14-9-7-13(8-10-14)15-17-19-22(18-15)16(23)20(3)4/h5-10H,1-4H3
n/an/a 9n/an/an/an/an/an/a
University of M£nster
Curated by ChEMBL
Assay Description
Inhibition of FAAH in Sprague-Dawley rat brain microsomes assessed as N-(2-hydroxyethyl)-4-pyren-1-ylbutanamide conversion to 4-pyren-1-ylbutanoic ac...
Eur J Med Chem 63: 64-75 (2013)
Article DOI: 10.1016/j.ejmech.2013.01.050
BindingDB Entry DOI: 10.7270/Q2377B2N
Monoglyceride lipase
(Homo sapiens (Human))
BDBM50432842
(CHEMBL2376225)
Show SMILES CN(C)C(=O)n1nnc(n1)-c1ccc(cc1)-n1c(C)ccc1C
Show InChI InChI=1S/C16H18N6O/c1-11-5-6-12(2)21(11)14-9-7-13(8-10-14)15-17-19-22(18-15)16(23)20(3)4/h5-10H,1-4H3
Reactome pathway
n/an/a 48n/an/an/an/an/an/a
University of M£nster
Curated by ChEMBL
Assay Description
Inhibition of human recombinant MAGL-mediated 1,3-dihydroxypropan-1-yl 4-pyren-1-ylbutanoate conversion to 4-pyren-1-ylbutanoic acid preincubated for...
Eur J Med Chem 63: 64-75 (2013)
Article DOI: 10.1016/j.ejmech.2013.01.050
BindingDB Entry DOI: 10.7270/Q2377B2N