null
SMILES: COc1cc(C)nc(NC(=O)N(CCC(c2ccccc2)c2ccccc2)CCN2CCOCC2)n1
InChI Key: InChIKey=KLPWRARQXSFKDK-UHFFFAOYSA-N
Activity Spreadsheet -- Enzyme Inhibition Constant Data from BindingDB
Found 1 hit for monomerid = 50432956
Trg + Lig
Ki
nM
ΔG°
kcal/mole
IC50
nM
Kd
nM
EC50/IC50
nM
koff
s-1
kon
M-1s-1
pHTemp
°C
Extracellular calcium-sensing receptor
(Homo sapiens (Human))
BDBM50432956
(CHEMBL2377729)
Show SMILES COc1cc(C)nc(NC(=O)N(CCC(c2ccccc2)c2ccccc2)CCN2CCOCC2)n1
Show InChI InChI=1S/C28H35N5O3/c1-22-21-26(35-2)30-27(29-22)31-28(34)33(16-15-32-17-19-36-20-18-32)14-13-25(23-9-5-3-6-10-23)24-11-7-4-8-12-24/h3-12,21,25H,13-20H2,1-2H3,(H,29,30,31,34)
n/an/an/an/a 400n/an/an/an/a
Galapagos SASU
Curated by ChEMBL
Assay Description
Positive allosteric modulation of human CaSR expressed in CHO cells assessed as increase in intracellular calcium level after 5 hrs by luciferase rep...
Bioorg Med Chem Lett 23: 2455-9 (2013)
Article DOI: 10.1016/j.bmcl.2013.01.077
BindingDB Entry DOI: 10.7270/Q228090Q