null
SMILES: Clc1ccc2oc(NC(=O)N(CCC(c3ccccc3)c3ccccc3)CCN3CCOCC3)nc2c1
InChI Key: InChIKey=QQCSAJRNBXVHFE-UHFFFAOYSA-N
Activity Spreadsheet -- Enzyme Inhibition Constant Data from BindingDB
Found 1 hit for monomerid = 50432977
Trg + Lig
Ki
nM
ΔG°
kcal/mole
IC50
nM
Kd
nM
EC50/IC50
nM
koff
s-1
kon
M-1s-1
pHTemp
°C
Extracellular calcium-sensing receptor
(Homo sapiens (Human))
BDBM50432977
(CHEMBL2377739)
Show SMILES Clc1ccc2oc(NC(=O)N(CCC(c3ccccc3)c3ccccc3)CCN3CCOCC3)nc2c1
Show InChI InChI=1S/C29H31ClN4O3/c30-24-11-12-27-26(21-24)31-28(37-27)32-29(35)34(16-15-33-17-19-36-20-18-33)14-13-25(22-7-3-1-4-8-22)23-9-5-2-6-10-23/h1-12,21,25H,13-20H2,(H,31,32,35)
n/an/an/an/a 80n/an/an/an/a
Galapagos SASU
Curated by ChEMBL
Assay Description
Positive allosteric modulation of human CaSR expressed in CHO cells assessed as increase in intracellular calcium level after 5 hrs by luciferase rep...
Bioorg Med Chem Lett 23: 2455-9 (2013)
Article DOI: 10.1016/j.bmcl.2013.01.077
BindingDB Entry DOI: 10.7270/Q228090Q