BDBM50433135 CHEMBL2377617
SMILES: Fc1ccc(nc1)N1CCN(CC(=O)c2cnc3ccccn23)CC1
InChI Key: InChIKey=XFXMJZLHNHVOOL-UHFFFAOYSA-N
Data: 2 IC50
Activity Spreadsheet -- Enzyme Inhibition Constant Data from BindingDB
Found 2 hits for monomerid = 50433135
Trg + Lig
Ki
nM
ΔG°
kcal/mole
IC50
nM
Kd
nM
EC50/IC50
nM
koff
s-1
kon
M-1s-1
pHTemp
°C
Long-chain fatty acid transport protein 1
(Homo sapiens (Human))
BDBM50433135
(CHEMBL2377617)
Show SMILES Fc1ccc(nc1)N1CCN(CC(=O)c2cnc3ccccn23)CC1
Show InChI InChI=1S/C18H18FN5O/c19-14-4-5-17(20-11-14)23-9-7-22(8-10-23)13-16(25)15-12-21-18-3-1-2-6-24(15)18/h1-6,11-12H,7-10,13H2
Reactome pathway
n/an/a 130n/an/an/an/an/an/a
Daiichi Sankyo Co., Ltd
Curated by ChEMBL
Assay Description
Inhibition of human FLAG-tagged FATP1-mediated [1-14C] oleic acid conversion to [1-14C] oleoyl-CoA after 20 mins by scintillation counting analysis
Bioorg Med Chem Lett 23: 2560-5 (2013)
Article DOI: 10.1016/j.bmcl.2013.02.116
BindingDB Entry DOI: 10.7270/Q2H70H6K
Long-chain fatty acid transport protein 1
(Mus musculus)
BDBM50433135
(CHEMBL2377617)
Show SMILES Fc1ccc(nc1)N1CCN(CC(=O)c2cnc3ccccn23)CC1
Show InChI InChI=1S/C18H18FN5O/c19-14-4-5-17(20-11-14)23-9-7-22(8-10-23)13-16(25)15-12-21-18-3-1-2-6-24(15)18/h1-6,11-12H,7-10,13H2
Reactome pathway
n/an/a 290n/an/an/an/an/an/a
Daiichi Sankyo Co., Ltd
Curated by ChEMBL
Assay Description
Inhibition of mouse FLAG-tagged FATP1-mediated [1-14C] oleic acid conversion to [1-14C] oleoyl-CoA after 20 mins by scintillation counting analysis
Bioorg Med Chem Lett 23: 2560-5 (2013)
Article DOI: 10.1016/j.bmcl.2013.02.116
BindingDB Entry DOI: 10.7270/Q2H70H6K