BDBM50433139 CHEMBL2377622
SMILES: Fc1ccc(nc1)N1CCN(CC(=O)Nc2nc3CCCCc3o2)CC1
InChI Key: InChIKey=DOMJSSFQACRFCR-UHFFFAOYSA-N
Data: 2 IC50
Activity Spreadsheet -- Enzyme Inhibition Constant Data from BindingDB
Found 2 hits for monomerid = 50433139
Trg + Lig
Ki
nM
ΔG°
kcal/mole
IC50
nM
Kd
nM
EC50/IC50
nM
koff
s-1
kon
M-1s-1
pHTemp
°C
Long-chain fatty acid transport protein 1
(Homo sapiens (Human))
BDBM50433139
(CHEMBL2377622)
Show SMILES Fc1ccc(nc1)N1CCN(CC(=O)Nc2nc3CCCCc3o2)CC1
Show InChI InChI=1S/C18H22FN5O2/c19-13-5-6-16(20-11-13)24-9-7-23(8-10-24)12-17(25)22-18-21-14-3-1-2-4-15(14)26-18/h5-6,11H,1-4,7-10,12H2,(H,21,22,25)
Reactome pathway
n/an/a 100n/an/an/an/an/an/a
Daiichi Sankyo Co., Ltd
Curated by ChEMBL
Assay Description
Inhibition of human FLAG-tagged FATP1-mediated [1-14C] oleic acid conversion to [1-14C] oleoyl-CoA after 20 mins by scintillation counting analysis
Bioorg Med Chem Lett 23: 2560-5 (2013)
Article DOI: 10.1016/j.bmcl.2013.02.116
BindingDB Entry DOI: 10.7270/Q2H70H6K
Long-chain fatty acid transport protein 1
(Mus musculus)
BDBM50433139
(CHEMBL2377622)
Show SMILES Fc1ccc(nc1)N1CCN(CC(=O)Nc2nc3CCCCc3o2)CC1
Show InChI InChI=1S/C18H22FN5O2/c19-13-5-6-16(20-11-13)24-9-7-23(8-10-24)12-17(25)22-18-21-14-3-1-2-4-15(14)26-18/h5-6,11H,1-4,7-10,12H2,(H,21,22,25)
Reactome pathway
n/an/a 1.70E+3n/an/an/an/an/an/a
Daiichi Sankyo Co., Ltd
Curated by ChEMBL
Assay Description
Inhibition of mouse FLAG-tagged FATP1-mediated [1-14C] oleic acid conversion to [1-14C] oleoyl-CoA after 20 mins by scintillation counting analysis
Bioorg Med Chem Lett 23: 2560-5 (2013)
Article DOI: 10.1016/j.bmcl.2013.02.116
BindingDB Entry DOI: 10.7270/Q2H70H6K