BDBM50433145 CHEMBL2377757
SMILES: O=C(CN1CCN(CC1)c1ccccn1)Nc1nc2CCCCc2s1
InChI Key: InChIKey=VGCLHCOCGHCJIJ-UHFFFAOYSA-N
Data: 2 IC50
Activity Spreadsheet -- Enzyme Inhibition Constant Data from BindingDB
Found 2 hits for monomerid = 50433145
Trg + Lig
Ki
nM
ΔG°
kcal/mole
IC50
nM
Kd
nM
EC50/IC50
nM
koff
s-1
kon
M-1s-1
pHTemp
°C
Long-chain fatty acid transport protein 1
(Homo sapiens (Human))
BDBM50433145
(CHEMBL2377757)
Show SMILES O=C(CN1CCN(CC1)c1ccccn1)Nc1nc2CCCCc2s1
Show InChI InChI=1S/C18H23N5OS/c24-17(21-18-20-14-5-1-2-6-15(14)25-18)13-22-9-11-23(12-10-22)16-7-3-4-8-19-16/h3-4,7-8H,1-2,5-6,9-13H2,(H,20,21,24)
Reactome pathway
n/an/a 200n/an/an/an/an/an/a
Daiichi Sankyo Co., Ltd
Curated by ChEMBL
Assay Description
Inhibition of human FLAG-tagged FATP1-mediated [1-14C] oleic acid conversion to [1-14C] oleoyl-CoA after 20 mins by scintillation counting analysis
Bioorg Med Chem Lett 23: 2560-5 (2013)
Article DOI: 10.1016/j.bmcl.2013.02.116
BindingDB Entry DOI: 10.7270/Q2H70H6K
Long-chain fatty acid transport protein 1
(Mus musculus)
BDBM50433145
(CHEMBL2377757)
Show SMILES O=C(CN1CCN(CC1)c1ccccn1)Nc1nc2CCCCc2s1
Show InChI InChI=1S/C18H23N5OS/c24-17(21-18-20-14-5-1-2-6-15(14)25-18)13-22-9-11-23(12-10-22)16-7-3-4-8-19-16/h3-4,7-8H,1-2,5-6,9-13H2,(H,20,21,24)
Reactome pathway
n/an/a 4.90E+3n/an/an/an/an/an/a
Daiichi Sankyo Co., Ltd
Curated by ChEMBL
Assay Description
Inhibition of mouse FLAG-tagged FATP1-mediated [1-14C] oleic acid conversion to [1-14C] oleoyl-CoA after 20 mins by scintillation counting analysis
Bioorg Med Chem Lett 23: 2560-5 (2013)
Article DOI: 10.1016/j.bmcl.2013.02.116
BindingDB Entry DOI: 10.7270/Q2H70H6K