BDBM50433152 CHEMBL2377762
SMILES: Fc1ccc(cc1)N1CCN(CC(=O)Nc2nc3CCCc3s2)CC1
InChI Key: InChIKey=CVIGNRZDELXSSV-UHFFFAOYSA-N
Data: 2 IC50
Activity Spreadsheet -- Enzyme Inhibition Constant Data from BindingDB
Found 2 hits for monomerid = 50433152
Trg + Lig
Ki
nM
ΔG°
kcal/mole
IC50
nM
Kd
nM
EC50/IC50
nM
koff
s-1
kon
M-1s-1
pHTemp
°C
Long-chain fatty acid transport protein 1
(Homo sapiens (Human))
BDBM50433152
(CHEMBL2377762)
Show SMILES Fc1ccc(cc1)N1CCN(CC(=O)Nc2nc3CCCc3s2)CC1
Show InChI InChI=1S/C18H21FN4OS/c19-13-4-6-14(7-5-13)23-10-8-22(9-11-23)12-17(24)21-18-20-15-2-1-3-16(15)25-18/h4-7H,1-3,8-12H2,(H,20,21,24)
Reactome pathway
n/an/a 490n/an/an/an/an/an/a
Daiichi Sankyo Co., Ltd
Curated by ChEMBL
Assay Description
Inhibition of human FLAG-tagged FATP1-mediated [1-14C] oleic acid conversion to [1-14C] oleoyl-CoA after 20 mins by scintillation counting analysis
Bioorg Med Chem Lett 23: 2560-5 (2013)
Article DOI: 10.1016/j.bmcl.2013.02.116
BindingDB Entry DOI: 10.7270/Q2H70H6K
Long-chain fatty acid transport protein 1
(Mus musculus)
BDBM50433152
(CHEMBL2377762)
Show SMILES Fc1ccc(cc1)N1CCN(CC(=O)Nc2nc3CCCc3s2)CC1
Show InChI InChI=1S/C18H21FN4OS/c19-13-4-6-14(7-5-13)23-10-8-22(9-11-23)12-17(24)21-18-20-15-2-1-3-16(15)25-18/h4-7H,1-3,8-12H2,(H,20,21,24)
Reactome pathway
n/an/a>1.00E+4n/an/an/an/an/an/a
Daiichi Sankyo Co., Ltd
Curated by ChEMBL
Assay Description
Inhibition of mouse FLAG-tagged FATP1-mediated [1-14C] oleic acid conversion to [1-14C] oleoyl-CoA after 20 mins by scintillation counting analysis
Bioorg Med Chem Lett 23: 2560-5 (2013)
Article DOI: 10.1016/j.bmcl.2013.02.116
BindingDB Entry DOI: 10.7270/Q2H70H6K