BDBM50433286 CHEMBL2376309
SMILES: Clc1ccc(NS(=O)(=O)c2ccc3NC(=O)C4(CCCC4)NC(=O)c3c2)cc1
InChI Key: InChIKey=GORRZUXJXZXLMH-UHFFFAOYSA-N
Data: 1 IC50
Activity Spreadsheet -- Enzyme Inhibition Constant Data from BindingDB
Found 1 hit for monomerid = 50433286
Trg + Lig
Ki
nM
ΔG°
kcal/mole
IC50
nM
Kd
nM
EC50/IC50
nM
koff
s-1
kon
M-1s-1
pHTemp
°C
Alpha-1,6-mannosyl-glycoprotein 2-beta-N-acetylglucosaminyltransferase
(Homo sapiens (Human))
BDBM50433286
(CHEMBL2376309)
Show SMILES Clc1ccc(NS(=O)(=O)c2ccc3NC(=O)C4(CCCC4)NC(=O)c3c2)cc1
Show InChI InChI=1S/C19H18ClN3O4S/c20-12-3-5-13(6-4-12)23-28(26,27)14-7-8-16-15(11-14)17(24)22-19(18(25)21-16)9-1-2-10-19/h3-8,11,23H,1-2,9-10H2,(H,21,25)(H,22,24)
n/an/a 50n/an/an/an/an/an/a
AstraZeneca
Curated by ChEMBL
Assay Description
Inhibition of human recombinant MGAT2 expressed in insect cell membrane using 2-oleoyl-sn-glycerol and oleoyl coenzyme A as substrate after 40 mins b...
Bioorg Med Chem Lett 23: 2721-6 (2013)
Article DOI: 10.1016/j.bmcl.2013.02.084
BindingDB Entry DOI: 10.7270/Q2GB25DM