BDBM50433296 CHEMBL2376437
SMILES: C[C@@H](NC(=O)c1c[nH]c2ncc(Oc3ccc4CC[C@@H](NC(C)=O)c4c3)nc12)C1CC1
InChI Key: InChIKey=ZLMYXZMBDPHCEG-CWTRNNRKSA-N
Data: 6 IC50
Activity Spreadsheet -- Enzyme Inhibition Constant Data from BindingDB
Found 6 hits for monomerid = 50433296
Trg + Lig
Ki
nM
ΔG°
kcal/mole
IC50
nM
Kd
nM
EC50/IC50
nM
koff
s-1
kon
M-1s-1
pHTemp
°C
JAK2/JAK1
(Homo sapiens (Human))
BDBM50433296
(CHEMBL2376437)
Show SMILES C[C@@H](NC(=O)c1c[nH]c2ncc(Oc3ccc4CC[C@@H](NC(C)=O)c4c3)nc12)C1CC1 |r|
Show InChI InChI=1S/C23H25N5O3/c1-12(14-3-4-14)26-23(30)18-10-24-22-21(18)28-20(11-25-22)31-16-7-5-15-6-8-19(17(15)9-16)27-13(2)29/h5,7,9-12,14,19H,3-4,6,8H2,1-2H3,(H,24,25)(H,26,30)(H,27,29)/t12-,19-/m1/s1
n/an/a>3.00E+4n/an/an/an/an/an/a
Hoffmann-La Roche Inc.
Curated by ChEMBL
Assay Description
Inhibition of JAK1/2 in human PBMC expressing CD14 assessed as inhibition of IFNgamma-induced STAT1 phosphorylation
Bioorg Med Chem Lett 23: 2522-6 (2013)
Article DOI: 10.1016/j.bmcl.2013.03.015
BindingDB Entry DOI: 10.7270/Q2BK1DRS
Tyrosine-protein kinase JAK2
(Homo sapiens (Human))
BDBM50433296
(CHEMBL2376437)
Show SMILES C[C@@H](NC(=O)c1c[nH]c2ncc(Oc3ccc4CC[C@@H](NC(C)=O)c4c3)nc12)C1CC1 |r|
Show InChI InChI=1S/C23H25N5O3/c1-12(14-3-4-14)26-23(30)18-10-24-22-21(18)28-20(11-25-22)31-16-7-5-15-6-8-19(17(15)9-16)27-13(2)29/h5,7,9-12,14,19H,3-4,6,8H2,1-2H3,(H,24,25)(H,26,30)(H,27,29)/t12-,19-/m1/s1
Reactome pathway
n/an/a 1.62E+4n/an/an/an/an/an/a
Hoffmann-La Roche Inc.
Curated by ChEMBL
Assay Description
Inhibition of JAK2 in human PBMC expressing CD14 assessed as inhibition of GM-CSF-induced STAT5a phosphorylation
Bioorg Med Chem Lett 23: 2522-6 (2013)
Article DOI: 10.1016/j.bmcl.2013.03.015
BindingDB Entry DOI: 10.7270/Q2BK1DRS
Tyrosine-protein kinase JAK3
(Homo sapiens (Human))
BDBM50433296
(CHEMBL2376437)
Show SMILES C[C@@H](NC(=O)c1c[nH]c2ncc(Oc3ccc4CC[C@@H](NC(C)=O)c4c3)nc12)C1CC1 |r|
Show InChI InChI=1S/C23H25N5O3/c1-12(14-3-4-14)26-23(30)18-10-24-22-21(18)28-20(11-25-22)31-16-7-5-15-6-8-19(17(15)9-16)27-13(2)29/h5,7,9-12,14,19H,3-4,6,8H2,1-2H3,(H,24,25)(H,26,30)(H,27,29)/t12-,19-/m1/s1
Reactome pathway
n/an/a 14n/an/an/an/an/an/a
Hoffmann-La Roche Inc.
Curated by ChEMBL
Assay Description
Inhibition of JAK3 (unknown origin) using Biotin-KAIETDKEYYTVKD as substrate and [33Pgamma]ATP incubated for 10 mins prior to substrate addition meas...
Bioorg Med Chem Lett 23: 2522-6 (2013)
Article DOI: 10.1016/j.bmcl.2013.03.015
BindingDB Entry DOI: 10.7270/Q2BK1DRS
Tyrosine-protein kinase JAK1
(Homo sapiens (Human))
BDBM50433296
(CHEMBL2376437)
Show SMILES C[C@@H](NC(=O)c1c[nH]c2ncc(Oc3ccc4CC[C@@H](NC(C)=O)c4c3)nc12)C1CC1 |r|
Show InChI InChI=1S/C23H25N5O3/c1-12(14-3-4-14)26-23(30)18-10-24-22-21(18)28-20(11-25-22)31-16-7-5-15-6-8-19(17(15)9-16)27-13(2)29/h5,7,9-12,14,19H,3-4,6,8H2,1-2H3,(H,24,25)(H,26,30)(H,27,29)/t12-,19-/m1/s1
Reactome pathway
n/an/a 2.08E+3n/an/an/an/an/an/a
Hoffmann-La Roche Inc.
Curated by ChEMBL
Assay Description
Inhibition of JAK1 (unknown origin) using Biotin-KAIETDKEYYTVKD as substrate and [33Pgamma]ATP incubated for 10 mins prior to substrate addition meas...
Bioorg Med Chem Lett 23: 2522-6 (2013)
Article DOI: 10.1016/j.bmcl.2013.03.015
BindingDB Entry DOI: 10.7270/Q2BK1DRS
Tyrosine-protein kinase JAK2
(Homo sapiens (Human))
BDBM50433296
(CHEMBL2376437)
Show SMILES C[C@@H](NC(=O)c1c[nH]c2ncc(Oc3ccc4CC[C@@H](NC(C)=O)c4c3)nc12)C1CC1 |r|
Show InChI InChI=1S/C23H25N5O3/c1-12(14-3-4-14)26-23(30)18-10-24-22-21(18)28-20(11-25-22)31-16-7-5-15-6-8-19(17(15)9-16)27-13(2)29/h5,7,9-12,14,19H,3-4,6,8H2,1-2H3,(H,24,25)(H,26,30)(H,27,29)/t12-,19-/m1/s1
Reactome pathway
n/an/a 194n/an/an/an/an/an/a
Hoffmann-La Roche Inc.
Curated by ChEMBL
Assay Description
Inhibition of JAK2 (unknown origin) expressed in SF21 cells using Biotin-KAIETDKEYYTVKD as substrate and [33Pgamma]ATP incubated for 10 mins prior to...
Bioorg Med Chem Lett 23: 2522-6 (2013)
Article DOI: 10.1016/j.bmcl.2013.03.015
BindingDB Entry DOI: 10.7270/Q2BK1DRS
JAK3/JAK1
(Homo sapiens (Human))
BDBM50433296
(CHEMBL2376437)
Show SMILES C[C@@H](NC(=O)c1c[nH]c2ncc(Oc3ccc4CC[C@@H](NC(C)=O)c4c3)nc12)C1CC1 |r|
Show InChI InChI=1S/C23H25N5O3/c1-12(14-3-4-14)26-23(30)18-10-24-22-21(18)28-20(11-25-22)31-16-7-5-15-6-8-19(17(15)9-16)27-13(2)29/h5,7,9-12,14,19H,3-4,6,8H2,1-2H3,(H,24,25)(H,26,30)(H,27,29)/t12-,19-/m1/s1
n/an/a 1.75E+3n/an/an/an/an/an/a
Hoffmann-La Roche Inc.
Curated by ChEMBL
Assay Description
Inhibition of JAK1/3 in human PBMC expressing CD3 assessed as inhibition of IL2-induced STAT5a phosphorylation
Bioorg Med Chem Lett 23: 2522-6 (2013)
Article DOI: 10.1016/j.bmcl.2013.03.015
BindingDB Entry DOI: 10.7270/Q2BK1DRS