BDBM50433384 CHEMBL45721
SMILES: C1CN(CCO1)c1cc(nc2ccccc12)-c1ccccn1
InChI Key: InChIKey=FHGLROTYMYQNCC-UHFFFAOYSA-N
Data: 3 EC50
Activity Spreadsheet -- Enzyme Inhibition Constant Data from BindingDB
Found 3 hits for monomerid = 50433384
Trg + Lig
Ki
nM
ΔG°
kcal/mole
IC50
nM
Kd
nM
EC50/IC50
nM
koff
s-1
kon
M-1s-1
pHTemp
°C
Methionine Aminopeptidase Type 1 (MetAP1)
(Homo sapiens (Human))
BDBM50433384
(CHEMBL45721)
Show SMILES C1CN(CCO1)c1cc(nc2ccccc12)-c1ccccn1
Show InChI InChI=1S/C18H17N3O/c1-2-6-15-14(5-1)18(21-9-11-22-12-10-21)13-17(20-15)16-7-3-4-8-19-16/h1-8,13H,9-12H2
Reactome pathway
n/an/an/an/a 410n/an/an/an/a
Johns Hopkins University School of Medicine
Curated by ChEMBL
Assay Description
Inhibition of human methionine aminopeptidase 1 in presence of Co2+
J Med Chem 56: 3996-4016 (2013)
Article DOI: 10.1021/jm400227z
BindingDB Entry DOI: 10.7270/Q2SJ1N1Z
Methionine aminopeptidase 2
(Homo sapiens (Human))
BDBM50433384
(CHEMBL45721)
Show SMILES C1CN(CCO1)c1cc(nc2ccccc12)-c1ccccn1
Show InChI InChI=1S/C18H17N3O/c1-2-6-15-14(5-1)18(21-9-11-22-12-10-21)13-17(20-15)16-7-3-4-8-19-16/h1-8,13H,9-12H2
Reactome pathway
n/an/an/an/a>1.00E+5n/an/an/an/a
Johns Hopkins University School of Medicine
Curated by ChEMBL
Assay Description
Inhibition of human methionine aminopeptidase 2 in presence of Mn2+
J Med Chem 56: 3996-4016 (2013)
Article DOI: 10.1021/jm400227z
BindingDB Entry DOI: 10.7270/Q2SJ1N1Z
Methionine Aminopeptidase Type 1 (MetAP1)
(Homo sapiens (Human))
BDBM50433384
(CHEMBL45721)
Show SMILES C1CN(CCO1)c1cc(nc2ccccc12)-c1ccccn1
Show InChI InChI=1S/C18H17N3O/c1-2-6-15-14(5-1)18(21-9-11-22-12-10-21)13-17(20-15)16-7-3-4-8-19-16/h1-8,13H,9-12H2
Reactome pathway
n/an/an/an/a>1.00E+5n/an/an/an/a
Johns Hopkins University School of Medicine
Curated by ChEMBL
Assay Description
Inhibition of human methionine aminopeptidase 1 in presence of Mn2+
J Med Chem 56: 3996-4016 (2013)
Article DOI: 10.1021/jm400227z
BindingDB Entry DOI: 10.7270/Q2SJ1N1Z