BDBM50433386 CHEMBL2375615
SMILES: CC(O)c1ccc(cc1)N1CCN(CC1)c1cc(nc2ccccc12)-c1ccccn1
InChI Key: InChIKey=UQFQVMODAAJALN-UHFFFAOYSA-N
Data: 3 EC50
Activity Spreadsheet -- Enzyme Inhibition Constant Data from BindingDB
Found 3 hits for monomerid = 50433386
Trg + Lig
Ki
nM
ΔG°
kcal/mole
IC50
nM
Kd
nM
EC50/IC50
nM
koff
s-1
kon
M-1s-1
pHTemp
°C
Methionine Aminopeptidase Type 1 (MetAP1)
(Homo sapiens (Human))
BDBM50433386
(CHEMBL2375615)
Show SMILES CC(O)c1ccc(cc1)N1CCN(CC1)c1cc(nc2ccccc12)-c1ccccn1
Show InChI InChI=1S/C26H26N4O/c1-19(31)20-9-11-21(12-10-20)29-14-16-30(17-15-29)26-18-25(24-8-4-5-13-27-24)28-23-7-3-2-6-22(23)26/h2-13,18-19,31H,14-17H2,1H3
Reactome pathway
n/an/an/an/a 73n/an/an/an/a
Johns Hopkins University School of Medicine
Curated by ChEMBL
Assay Description
Inhibition of human methionine aminopeptidase 1 in presence of Co2+
J Med Chem 56: 3996-4016 (2013)
Article DOI: 10.1021/jm400227z
BindingDB Entry DOI: 10.7270/Q2SJ1N1Z
Methionine aminopeptidase 2
(Homo sapiens (Human))
BDBM50433386
(CHEMBL2375615)
Show SMILES CC(O)c1ccc(cc1)N1CCN(CC1)c1cc(nc2ccccc12)-c1ccccn1
Show InChI InChI=1S/C26H26N4O/c1-19(31)20-9-11-21(12-10-20)29-14-16-30(17-15-29)26-18-25(24-8-4-5-13-27-24)28-23-7-3-2-6-22(23)26/h2-13,18-19,31H,14-17H2,1H3
Reactome pathway
n/an/an/an/a>1.00E+5n/an/an/an/a
Johns Hopkins University School of Medicine
Curated by ChEMBL
Assay Description
Inhibition of human methionine aminopeptidase 2 in presence of Mn2+
J Med Chem 56: 3996-4016 (2013)
Article DOI: 10.1021/jm400227z
BindingDB Entry DOI: 10.7270/Q2SJ1N1Z
Methionine Aminopeptidase Type 1 (MetAP1)
(Homo sapiens (Human))
BDBM50433386
(CHEMBL2375615)
Show SMILES CC(O)c1ccc(cc1)N1CCN(CC1)c1cc(nc2ccccc12)-c1ccccn1
Show InChI InChI=1S/C26H26N4O/c1-19(31)20-9-11-21(12-10-20)29-14-16-30(17-15-29)26-18-25(24-8-4-5-13-27-24)28-23-7-3-2-6-22(23)26/h2-13,18-19,31H,14-17H2,1H3
Reactome pathway
n/an/an/an/a 8.40E+3n/an/an/an/a
Johns Hopkins University School of Medicine
Curated by ChEMBL
Assay Description
Inhibition of human methionine aminopeptidase 1 in presence of Mn2+
J Med Chem 56: 3996-4016 (2013)
Article DOI: 10.1021/jm400227z
BindingDB Entry DOI: 10.7270/Q2SJ1N1Z