BDBM50433477 CHEMBL2381224
SMILES: COc1ccc2CN(C(=O)c2c1)c1nc(cs1)C(=O)Nc1cnc(C)cc1N1CCNCC1
InChI Key: InChIKey=ZYULPKVFAYVWGR-UHFFFAOYSA-N
Data: 1 IC50  1 EC50
Activity Spreadsheet -- Enzyme Inhibition Constant Data from BindingDB
Found 2 hits for monomerid = 50433477
Trg + Lig
Ki
nM
ΔG°
kcal/mole
IC50
nM
Kd
nM
EC50/IC50
nM
koff
s-1
kon
M-1s-1
pHTemp
°C
Serine/threonine-protein kinase Chk1
(Homo sapiens (Human))
BDBM50433477
(CHEMBL2381224)
Show SMILES COc1ccc2CN(C(=O)c2c1)c1nc(cs1)C(=O)Nc1cnc(C)cc1N1CCNCC1
Show InChI InChI=1S/C23H24N6O3S/c1-14-9-20(28-7-5-24-6-8-28)18(11-25-14)26-21(30)19-13-33-23(27-19)29-12-15-3-4-16(32-2)10-17(15)22(29)31/h3-4,9-11,13,24H,5-8,12H2,1-2H3,(H,26,30)
Reactome pathway
n/an/a 10n/an/an/an/an/an/a
Merck Research Laboratories
Curated by ChEMBL
Assay Description
Inhibition of recombinant His-tagged CHK1 (unknown origin) expressed in baculovirus expression system using biotin-RSGLYRSPSMPENLNRPR as substrate af...
Bioorg Med Chem Lett 23: 2590-4 (2013)
Article DOI: 10.1016/j.bmcl.2013.02.108
BindingDB Entry DOI: 10.7270/Q2125V19
Serine/threonine-protein kinase Chk1
(Homo sapiens (Human))
BDBM50433477
(CHEMBL2381224)
Show SMILES COc1ccc2CN(C(=O)c2c1)c1nc(cs1)C(=O)Nc1cnc(C)cc1N1CCNCC1
Show InChI InChI=1S/C23H24N6O3S/c1-14-9-20(28-7-5-24-6-8-28)18(11-25-14)26-21(30)19-13-33-23(27-19)29-12-15-3-4-16(32-2)10-17(15)22(29)31/h3-4,9-11,13,24H,5-8,12H2,1-2H3,(H,26,30)
Reactome pathway
n/an/an/an/a 1.00E+3n/an/an/an/a
Merck Research Laboratories
Curated by ChEMBL
Assay Description
Inhibition of CHK1 in human U2OS cells assessed as phosphorylation of H2AX after 2 hrs by FITC/propidium iodide staining-based immunofluorescence ass...
Bioorg Med Chem Lett 23: 2590-4 (2013)
Article DOI: 10.1016/j.bmcl.2013.02.108
BindingDB Entry DOI: 10.7270/Q2125V19