null
SMILES: O=C(Nc1cnccc1N1CCNCC1)c1csc(n1)N1Cc2ccccc2C1
InChI Key: InChIKey=AYAXVQBKPXNVMJ-UHFFFAOYSA-N
Activity Spreadsheet -- Enzyme Inhibition Constant Data from BindingDB
Found 2 hits for monomerid = 50433482
Trg + Lig
Ki
nM
ΔG°
kcal/mole
IC50
nM
Kd
nM
EC50/IC50
nM
koff
s-1
kon
M-1s-1
pHTemp
°C
Serine/threonine-protein kinase Chk1
(Homo sapiens (Human))
BDBM50433482
(CHEMBL2381114)
Show SMILES O=C(Nc1cnccc1N1CCNCC1)c1csc(n1)N1Cc2ccccc2C1
Show InChI InChI=1S/C21H22N6OS/c28-20(24-17-11-23-6-5-19(17)26-9-7-22-8-10-26)18-14-29-21(25-18)27-12-15-3-1-2-4-16(15)13-27/h1-6,11,14,22H,7-10,12-13H2,(H,24,28)
Reactome pathway
n/an/a 8n/an/an/an/an/an/a
Merck Research Laboratories
Curated by ChEMBL
Assay Description
Inhibition of recombinant His-tagged CHK1 (unknown origin) expressed in baculovirus expression system using biotin-RSGLYRSPSMPENLNRPR as substrate af...
Bioorg Med Chem Lett 23: 2590-4 (2013)
Article DOI: 10.1016/j.bmcl.2013.02.108
BindingDB Entry DOI: 10.7270/Q2125V19
Serine/threonine-protein kinase Chk1
(Homo sapiens (Human))
BDBM50433482
(CHEMBL2381114)
Show SMILES O=C(Nc1cnccc1N1CCNCC1)c1csc(n1)N1Cc2ccccc2C1
Show InChI InChI=1S/C21H22N6OS/c28-20(24-17-11-23-6-5-19(17)26-9-7-22-8-10-26)18-14-29-21(25-18)27-12-15-3-1-2-4-16(15)13-27/h1-6,11,14,22H,7-10,12-13H2,(H,24,28)
Reactome pathway
n/an/an/an/a 900n/an/an/an/a
Merck Research Laboratories
Curated by ChEMBL
Assay Description
Inhibition of CHK1 in human U2OS cells assessed as phosphorylation of H2AX after 2 hrs by FITC/propidium iodide staining-based immunofluorescence ass...
Bioorg Med Chem Lett 23: 2590-4 (2013)
Article DOI: 10.1016/j.bmcl.2013.02.108
BindingDB Entry DOI: 10.7270/Q2125V19