null
SMILES: COc1ccc2CN(C(=O)c2c1)c1nc(cs1)C(=O)Nc1ccccc1N1CCNCC1
InChI Key: InChIKey=ZLFQOGCIPAWQRO-UHFFFAOYSA-N
Activity Spreadsheet -- Enzyme Inhibition Constant Data from BindingDB
Found 2 hits for monomerid = 50433489
Trg + Lig
Ki
nM
ΔG°
kcal/mole
IC50
nM
Kd
nM
EC50/IC50
nM
koff
s-1
kon
M-1s-1
pHTemp
°C
Serine/threonine-protein kinase Chk1
(Homo sapiens (Human))
BDBM50433489
(CHEMBL2381248)
Show SMILES COc1ccc2CN(C(=O)c2c1)c1nc(cs1)C(=O)Nc1ccccc1N1CCNCC1
Show InChI InChI=1S/C23H23N5O3S/c1-31-16-7-6-15-13-28(22(30)17(15)12-16)23-26-19(14-32-23)21(29)25-18-4-2-3-5-20(18)27-10-8-24-9-11-27/h2-7,12,14,24H,8-11,13H2,1H3,(H,25,29)
Reactome pathway
n/an/a 5n/an/an/an/an/an/a
Merck Research Laboratories
Curated by ChEMBL
Assay Description
Inhibition of recombinant His-tagged CHK1 (unknown origin) expressed in baculovirus expression system using biotin-RSGLYRSPSMPENLNRPR as substrate af...
Bioorg Med Chem Lett 23: 2590-4 (2013)
Article DOI: 10.1016/j.bmcl.2013.02.108
BindingDB Entry DOI: 10.7270/Q2125V19
Serine/threonine-protein kinase Chk1
(Homo sapiens (Human))
BDBM50433489
(CHEMBL2381248)
Show SMILES COc1ccc2CN(C(=O)c2c1)c1nc(cs1)C(=O)Nc1ccccc1N1CCNCC1
Show InChI InChI=1S/C23H23N5O3S/c1-31-16-7-6-15-13-28(22(30)17(15)12-16)23-26-19(14-32-23)21(29)25-18-4-2-3-5-20(18)27-10-8-24-9-11-27/h2-7,12,14,24H,8-11,13H2,1H3,(H,25,29)
Reactome pathway
n/an/an/an/a 250n/an/an/an/a
Merck Research Laboratories
Curated by ChEMBL
Assay Description
Inhibition of CHK1 in human U2OS cells assessed as phosphorylation of H2AX after 2 hrs by FITC/propidium iodide staining-based immunofluorescence ass...
Bioorg Med Chem Lett 23: 2590-4 (2013)
Article DOI: 10.1016/j.bmcl.2013.02.108
BindingDB Entry DOI: 10.7270/Q2125V19