BDBM50433490 CHEMBL2381246
SMILES: O=C(Nc1ccccc1N1CCNCC1)c1csc(n1)-n1ncc2ccccc12
InChI Key: InChIKey=WQIZBWOPEUALCL-UHFFFAOYSA-N
Data: 1 IC50  1 EC50
PDB links: 1 PDB ID matches this monomer.
Activity Spreadsheet -- Enzyme Inhibition Constant Data from BindingDB
Found 2 hits for monomerid = 50433490
Trg + Lig
Ki
nM
ΔG°
kcal/mole
IC50
nM
Kd
nM
EC50/IC50
nM
koff
s-1
kon
M-1s-1
pHTemp
°C
Serine/threonine-protein kinase Chk1
(Homo sapiens (Human))
BDBM50433490
(CHEMBL2381246)
Show SMILES O=C(Nc1ccccc1N1CCNCC1)c1csc(n1)-n1ncc2ccccc12
Show InChI InChI=1S/C21H20N6OS/c28-20(24-16-6-2-4-8-19(16)26-11-9-22-10-12-26)17-14-29-21(25-17)27-18-7-3-1-5-15(18)13-23-27/h1-8,13-14,22H,9-12H2,(H,24,28)
Reactome pathway
n/an/a 2n/an/an/an/an/an/a
Merck Research Laboratories
Curated by ChEMBL
Assay Description
Inhibition of recombinant His-tagged CHK1 (unknown origin) expressed in baculovirus expression system using biotin-RSGLYRSPSMPENLNRPR as substrate af...
Bioorg Med Chem Lett 23: 2590-4 (2013)
Article DOI: 10.1016/j.bmcl.2013.02.108
BindingDB Entry DOI: 10.7270/Q2125V19
3D
3D Structure (crystal)
Serine/threonine-protein kinase Chk1
(Homo sapiens (Human))
BDBM50433490
(CHEMBL2381246)
Show SMILES O=C(Nc1ccccc1N1CCNCC1)c1csc(n1)-n1ncc2ccccc12
Show InChI InChI=1S/C21H20N6OS/c28-20(24-16-6-2-4-8-19(16)26-11-9-22-10-12-26)17-14-29-21(25-17)27-18-7-3-1-5-15(18)13-23-27/h1-8,13-14,22H,9-12H2,(H,24,28)
Reactome pathway
n/an/an/an/a 750n/an/an/an/a
Merck Research Laboratories
Curated by ChEMBL
Assay Description
Inhibition of CHK1 in human U2OS cells assessed as phosphorylation of H2AX after 2 hrs by FITC/propidium iodide staining-based immunofluorescence ass...
Bioorg Med Chem Lett 23: 2590-4 (2013)
Article DOI: 10.1016/j.bmcl.2013.02.108
BindingDB Entry DOI: 10.7270/Q2125V19
3D
3D Structure (crystal)