null
SMILES: O=C(Nc1ccccc1N1CCNCC1)c1csc(n1)N1CCc2ccccc2C1
InChI Key: InChIKey=MJNWMUPXKIPHGT-UHFFFAOYSA-N
Activity Spreadsheet -- Enzyme Inhibition Constant Data from BindingDB
Found 1 hit for monomerid = 50433515
Trg + Lig
Ki
nM
ΔG°
kcal/mole
IC50
nM
Kd
nM
EC50/IC50
nM
koff
s-1
kon
M-1s-1
pHTemp
°C
Serine/threonine-protein kinase Chk1
(Homo sapiens (Human))
BDBM50433515
(CHEMBL2381233)
Show SMILES O=C(Nc1ccccc1N1CCNCC1)c1csc(n1)N1CCc2ccccc2C1
Show InChI InChI=1S/C23H25N5OS/c29-22(25-19-7-3-4-8-21(19)27-13-10-24-11-14-27)20-16-30-23(26-20)28-12-9-17-5-1-2-6-18(17)15-28/h1-8,16,24H,9-15H2,(H,25,29)
Reactome pathway
n/an/a 38n/an/an/an/an/an/a
Merck Research Laboratories
Curated by ChEMBL
Assay Description
Inhibition of recombinant His-tagged CHK1 (unknown origin) expressed in baculovirus expression system using biotin-RSGLYRSPSMPENLNRPR as substrate af...
Bioorg Med Chem Lett 23: 2590-4 (2013)
Article DOI: 10.1016/j.bmcl.2013.02.108
BindingDB Entry DOI: 10.7270/Q2125V19