null
SMILES: CN(c1nc(cs1)C(=O)Nc1ccccc1N1CCNCC1)c1ccccc1
InChI Key: InChIKey=KVWPVNNATUQLIH-UHFFFAOYSA-N
Activity Spreadsheet -- Enzyme Inhibition Constant Data from BindingDB
Found 1 hit for monomerid = 50433518
Trg + Lig
Ki
nM
ΔG°
kcal/mole
IC50
nM
Kd
nM
EC50/IC50
nM
koff
s-1
kon
M-1s-1
pHTemp
°C
Serine/threonine-protein kinase Chk1
(Homo sapiens (Human))
BDBM50433518
(CHEMBL2381230)
Show SMILES CN(c1nc(cs1)C(=O)Nc1ccccc1N1CCNCC1)c1ccccc1
Show InChI InChI=1S/C21H23N5OS/c1-25(16-7-3-2-4-8-16)21-24-18(15-28-21)20(27)23-17-9-5-6-10-19(17)26-13-11-22-12-14-26/h2-10,15,22H,11-14H2,1H3,(H,23,27)
Reactome pathway
n/an/a 240n/an/an/an/an/an/a
Merck Research Laboratories
Curated by ChEMBL
Assay Description
Inhibition of recombinant His-tagged CHK1 (unknown origin) expressed in baculovirus expression system using biotin-RSGLYRSPSMPENLNRPR as substrate af...
Bioorg Med Chem Lett 23: 2590-4 (2013)
Article DOI: 10.1016/j.bmcl.2013.02.108
BindingDB Entry DOI: 10.7270/Q2125V19