BDBM50433538 CHEMBL2381278
SMILES: CC(C)n1ncnc1-c1nc-2c(CCOc3cc(ccc-23)C2CN(C2)C(=O)C(C)(C)N)s1
InChI Key: InChIKey=WMLSPOGDBZDOMR-UHFFFAOYSA-N
Data: 1 KI  2 IC50
Activity Spreadsheet -- Enzyme Inhibition Constant Data from BindingDB
Found 3 hits for monomerid = 50433538
Trg + Lig
Ki
nM
ΔG°
kcal/mole
IC50
nM
Kd
nM
EC50/IC50
nM
koff
s-1
kon
M-1s-1
pHTemp
°C
Phosphatidylinositol 4,5-bisphosphate 3-kinase catalytic subunit alpha isoform
(Homo sapiens (Human))
BDBM50433538
(CHEMBL2381278)
Show SMILES CC(C)n1ncnc1-c1nc-2c(CCOc3cc(ccc-23)C2CN(C2)C(=O)C(C)(C)N)s1
Show InChI InChI=1S/C23H28N6O2S/c1-13(2)29-20(25-12-26-29)21-27-19-16-6-5-14(9-17(16)31-8-7-18(19)32-21)15-10-28(11-15)22(30)23(3,4)24/h5-6,9,12-13,15H,7-8,10-11,24H2,1-4H3
NCI pathway
Reactome pathway
0.940n/an/an/an/an/an/an/an/a
Genentech, Inc.
Curated by ChEMBL
Assay Description
Inhibition of GST-fused human recombinant PI3Kalpha expressed in baculovirus infected SF9 cells after 1 hr by scintillation proximity assay in presen...
Bioorg Med Chem Lett 23: 2606-13 (2013)
Article DOI: 10.1016/j.bmcl.2013.02.102
BindingDB Entry DOI: 10.7270/Q2W95BKF
Phosphatidylinositol 4,5-bisphosphate 3-kinase catalytic subunit beta isoform
(Homo sapiens (Human))
BDBM50433538
(CHEMBL2381278)
Show SMILES CC(C)n1ncnc1-c1nc-2c(CCOc3cc(ccc-23)C2CN(C2)C(=O)C(C)(C)N)s1
Show InChI InChI=1S/C23H28N6O2S/c1-13(2)29-20(25-12-26-29)21-27-19-16-6-5-14(9-17(16)31-8-7-18(19)32-21)15-10-28(11-15)22(30)23(3,4)24/h5-6,9,12-13,15H,7-8,10-11,24H2,1-4H3
NCI pathway
Reactome pathway
n/an/a 13n/an/an/an/an/an/a
Genentech, Inc.
Curated by ChEMBL
Assay Description
Inhibition of GST-fused human recombinant PI3Kbeta expressed in baculovirus infected SF9 cells after 1 hr by scintillation proximity assay in presenc...
Bioorg Med Chem Lett 23: 2606-13 (2013)
Article DOI: 10.1016/j.bmcl.2013.02.102
BindingDB Entry DOI: 10.7270/Q2W95BKF
Phosphatidylinositol 4,5-bisphosphate 3-kinase catalytic subunit alpha isoform
(Homo sapiens (Human))
BDBM50433538
(CHEMBL2381278)
Show SMILES CC(C)n1ncnc1-c1nc-2c(CCOc3cc(ccc-23)C2CN(C2)C(=O)C(C)(C)N)s1
Show InChI InChI=1S/C23H28N6O2S/c1-13(2)29-20(25-12-26-29)21-27-19-16-6-5-14(9-17(16)31-8-7-18(19)32-21)15-10-28(11-15)22(30)23(3,4)24/h5-6,9,12-13,15H,7-8,10-11,24H2,1-4H3
NCI pathway
Reactome pathway
n/an/a 54n/an/an/an/an/an/a
Genentech, Inc.
Curated by ChEMBL
Assay Description
Inhibition of PI3Kalpha in human PC3 cells assessed as inhibition of AKT phosphorylation at Ser473 after 2 hrs by ELISA
Bioorg Med Chem Lett 23: 2606-13 (2013)
Article DOI: 10.1016/j.bmcl.2013.02.102
BindingDB Entry DOI: 10.7270/Q2W95BKF