null
SMILES: C[C@H](Nc1nc(Nc2cc(C)n[nH]2)nc(N2CCOCC2)c1Cl)c1ccc(F)cn1
InChI Key: InChIKey=CAVXKRYGYMMNGC-LBPRGKRZSA-N
Activity Spreadsheet -- Enzyme Inhibition Constant Data from BindingDB
Found 2 hits for monomerid = 50433606
Trg + Lig
Ki
nM
ΔG°
kcal/mole
IC50
nM
Kd
nM
EC50/IC50
nM
koff
s-1
kon
M-1s-1
pHTemp
°C
Tyrosine-protein kinase JAK2
(Homo sapiens (Human))
BDBM50433606
(CHEMBL2380329)
Show SMILES C[C@H](Nc1nc(Nc2cc(C)n[nH]2)nc(N2CCOCC2)c1Cl)c1ccc(F)cn1 |r|
Show InChI InChI=1S/C19H22ClFN8O/c1-11-9-15(28-27-11)24-19-25-17(23-12(2)14-4-3-13(21)10-22-14)16(20)18(26-19)29-5-7-30-8-6-29/h3-4,9-10,12H,5-8H2,1-2H3,(H3,23,24,25,26,27,28)/t12-/m0/s1
Reactome pathway
n/an/a 6n/an/an/an/an/an/a
AstraZeneca
Curated by ChEMBL
Assay Description
Inhibition of JAK2 (unknown origin) using biotinylated TYK2 peptide as substrate after 60 mins
Bioorg Med Chem Lett 23: 3105-10 (2013)
Article DOI: 10.1016/j.bmcl.2013.02.111
BindingDB Entry DOI: 10.7270/Q23T9JMX
Tyrosine-protein kinase JAK3
(Homo sapiens (Human))
BDBM50433606
(CHEMBL2380329)
Show SMILES C[C@H](Nc1nc(Nc2cc(C)n[nH]2)nc(N2CCOCC2)c1Cl)c1ccc(F)cn1 |r|
Show InChI InChI=1S/C19H22ClFN8O/c1-11-9-15(28-27-11)24-19-25-17(23-12(2)14-4-3-13(21)10-22-14)16(20)18(26-19)29-5-7-30-8-6-29/h3-4,9-10,12H,5-8H2,1-2H3,(H3,23,24,25,26,27,28)/t12-/m0/s1
Reactome pathway
n/an/a 262n/an/an/an/an/an/a
AstraZeneca
Curated by ChEMBL
Assay Description
Inhibition of JAK3 (unknown origin) using biotinylated poly-EY peptide as substrate after 60 mins by HTRF assay
Bioorg Med Chem Lett 23: 3105-10 (2013)
Article DOI: 10.1016/j.bmcl.2013.02.111
BindingDB Entry DOI: 10.7270/Q23T9JMX