BDBM50433633 CHEMBL2380832
SMILES: Fc1ccc(cc1F)C(=O)Nc1ccc(Nc2ccnc3[nH]c(=O)c4ccccc4c23)cc1
InChI Key: InChIKey=ZBPGILZGNLFHOC-UHFFFAOYSA-N
Data: 2 IC50
Activity Spreadsheet -- Enzyme Inhibition Constant Data from BindingDB
Found 2 hits for monomerid = 50433633
Trg + Lig
Ki
nM
ΔG°
kcal/mole
IC50
nM
Kd
nM
EC50/IC50
nM
koff
s-1
kon
M-1s-1
pHTemp
°C
Aurora kinase B
(Homo sapiens (Human))
BDBM50433633
(CHEMBL2380832)
Show SMILES Fc1ccc(cc1F)C(=O)Nc1ccc(Nc2ccnc3[nH]c(=O)c4ccccc4c23)cc1
Show InChI InChI=1S/C25H16F2N4O2/c26-19-10-5-14(13-20(19)27)24(32)30-16-8-6-15(7-9-16)29-21-11-12-28-23-22(21)17-3-1-2-4-18(17)25(33)31-23/h1-13H,(H,30,32)(H2,28,29,31,33)
Reactome pathway
n/an/a 0.800n/an/an/an/an/an/a
EMD Serono Research Institute, Inc.
Curated by ChEMBL
Assay Description
Inhibition of aurora-B (unknown origin)
Bioorg Med Chem Lett 23: 3081-7 (2013)
Article DOI: 10.1016/j.bmcl.2013.03.008
BindingDB Entry DOI: 10.7270/Q2QN686Z
Aurora kinase A
(Homo sapiens (Human))
BDBM50433633
(CHEMBL2380832)
Show SMILES Fc1ccc(cc1F)C(=O)Nc1ccc(Nc2ccnc3[nH]c(=O)c4ccccc4c23)cc1
Show InChI InChI=1S/C25H16F2N4O2/c26-19-10-5-14(13-20(19)27)24(32)30-16-8-6-15(7-9-16)29-21-11-12-28-23-22(21)17-3-1-2-4-18(17)25(33)31-23/h1-13H,(H,30,32)(H2,28,29,31,33)
NCI pathway
Reactome pathway
n/an/a 7n/an/an/an/an/an/a
EMD Serono Research Institute, Inc.
Curated by ChEMBL
Assay Description
Inhibition of aurora-A (unknown origin)
Bioorg Med Chem Lett 23: 3081-7 (2013)
Article DOI: 10.1016/j.bmcl.2013.03.008
BindingDB Entry DOI: 10.7270/Q2QN686Z