BDBM50433634 CHEMBL2380831
SMILES: Fc1cccc(F)c1C(=O)Nc1ccc(Nc2ccnc3[nH]c(=O)c4ccccc4c23)cc1
InChI Key: InChIKey=SBCKWBIUBYZDRL-UHFFFAOYSA-N
Data: 2 IC50
Activity Spreadsheet -- Enzyme Inhibition Constant Data from BindingDB
Found 2 hits for monomerid = 50433634
Trg + Lig
Ki
nM
ΔG°
kcal/mole
IC50
nM
Kd
nM
EC50/IC50
nM
koff
s-1
kon
M-1s-1
pHTemp
°C
Aurora kinase B
(Homo sapiens (Human))
BDBM50433634
(CHEMBL2380831)
Show SMILES Fc1cccc(F)c1C(=O)Nc1ccc(Nc2ccnc3[nH]c(=O)c4ccccc4c23)cc1
Show InChI InChI=1S/C25H16F2N4O2/c26-18-6-3-7-19(27)22(18)25(33)30-15-10-8-14(9-11-15)29-20-12-13-28-23-21(20)16-4-1-2-5-17(16)24(32)31-23/h1-13H,(H,30,33)(H2,28,29,31,32)
Reactome pathway
n/an/a 0.600n/an/an/an/an/an/a
EMD Serono Research Institute, Inc.
Curated by ChEMBL
Assay Description
Inhibition of aurora-B (unknown origin)
Bioorg Med Chem Lett 23: 3081-7 (2013)
Article DOI: 10.1016/j.bmcl.2013.03.008
BindingDB Entry DOI: 10.7270/Q2QN686Z
Aurora kinase A
(Homo sapiens (Human))
BDBM50433634
(CHEMBL2380831)
Show SMILES Fc1cccc(F)c1C(=O)Nc1ccc(Nc2ccnc3[nH]c(=O)c4ccccc4c23)cc1
Show InChI InChI=1S/C25H16F2N4O2/c26-18-6-3-7-19(27)22(18)25(33)30-15-10-8-14(9-11-15)29-20-12-13-28-23-21(20)16-4-1-2-5-17(16)24(32)31-23/h1-13H,(H,30,33)(H2,28,29,31,32)
NCI pathway
Reactome pathway
n/an/a 5n/an/an/an/an/an/a
EMD Serono Research Institute, Inc.
Curated by ChEMBL
Assay Description
Inhibition of aurora-A (unknown origin)
Bioorg Med Chem Lett 23: 3081-7 (2013)
Article DOI: 10.1016/j.bmcl.2013.03.008
BindingDB Entry DOI: 10.7270/Q2QN686Z