BDBM50433647 CHEMBL2380844
SMILES: CNc1ccc(Nc2ccnc3[nH]c(=O)c4ccccc4c23)cc1
InChI Key: InChIKey=SQVGIBXTRLFNOR-UHFFFAOYSA-N
Data: 1 IC50
Activity Spreadsheet -- Enzyme Inhibition Constant Data from BindingDB
Found 1 hit for monomerid = 50433647
Trg + Lig
Ki
nM
ΔG°
kcal/mole
IC50
nM
Kd
nM
EC50/IC50
nM
koff
s-1
kon
M-1s-1
pHTemp
°C
Aurora kinase A
(Homo sapiens (Human))
BDBM50433647
(CHEMBL2380844)
Show SMILES CNc1ccc(Nc2ccnc3[nH]c(=O)c4ccccc4c23)cc1
Show InChI InChI=1S/C19H16N4O/c1-20-12-6-8-13(9-7-12)22-16-10-11-21-18-17(16)14-4-2-3-5-15(14)19(24)23-18/h2-11,20H,1H3,(H2,21,22,23,24)
NCI pathway
Reactome pathway
n/an/a 471n/an/an/an/an/an/a
EMD Serono Research Institute, Inc.
Curated by ChEMBL
Assay Description
Inhibition of aurora-A (unknown origin)
Bioorg Med Chem Lett 23: 3081-7 (2013)
Article DOI: 10.1016/j.bmcl.2013.03.008
BindingDB Entry DOI: 10.7270/Q2QN686Z