BDBM50434314 CHEMBL2386570
SMILES: CN(CCF)C(=O)[C@H]1C[C@@H]1c1ccc(cc1)-c1ncn(C)c1Sc1ccc(Cl)cc1
InChI Key: InChIKey=FDFGHQMJROPWJE-UXHICEINSA-N
Data: 2 IC50
Activity Spreadsheet -- Enzyme Inhibition Constant Data from BindingDB
Found 2 hits for monomerid = 50434314
Trg + Lig
Ki
nM
ΔG°
kcal/mole
IC50
nM
Kd
nM
EC50/IC50
nM
koff
s-1
kon
M-1s-1
pHTemp
°C
Fatty-acid amide hydrolase 1
(Homo sapiens (Human))
BDBM50434314
(CHEMBL2386570)
Show SMILES CN(CCF)C(=O)[C@H]1C[C@@H]1c1ccc(cc1)-c1ncn(C)c1Sc1ccc(Cl)cc1 |r|
Show InChI InChI=1S/C23H23ClFN3OS/c1-27(12-11-25)22(29)20-13-19(20)15-3-5-16(6-4-15)21-23(28(2)14-26-21)30-18-9-7-17(24)8-10-18/h3-10,14,19-20H,11-13H2,1-2H3/t19-,20+/m1/s1
n/an/a 1.10n/an/an/an/an/an/a
Merck Research Laboratories
Curated by ChEMBL
Assay Description
Inhibition of human FAAH expressed in CHO cell lysates assessed as arachidonyl-7-amino-4-methylcoumarin amide hydrolysis to 7-amino 4-methyl coumarin...
ACS Med Chem Lett 4: 509-13 (2013)
Article DOI: 10.1021/ml4000996
BindingDB Entry DOI: 10.7270/Q21R6RWJ
Fatty-acid amide hydrolase 1 (aa 30-579)
(Rattus norvegicus (rat))
BDBM50434314
(CHEMBL2386570)
Show SMILES CN(CCF)C(=O)[C@H]1C[C@@H]1c1ccc(cc1)-c1ncn(C)c1Sc1ccc(Cl)cc1 |r|
Show InChI InChI=1S/C23H23ClFN3OS/c1-27(12-11-25)22(29)20-13-19(20)15-3-5-16(6-4-15)21-23(28(2)14-26-21)30-18-9-7-17(24)8-10-18/h3-10,14,19-20H,11-13H2,1-2H3/t19-,20+/m1/s1
n/an/a 1.30n/an/an/an/an/an/a
Merck Research Laboratories
Curated by ChEMBL
Assay Description
Inhibition of rat FAAH expressed in CHO cell lysates assessed as arachidonyl-7-amino-4-methylcoumarin amide hydrolysis to 7-amino 4-methyl coumarin p...
ACS Med Chem Lett 4: 509-13 (2013)
Article DOI: 10.1021/ml4000996
BindingDB Entry DOI: 10.7270/Q21R6RWJ